program: Gaussian 09
title: 000276203
version: EM64L-G09RevD.01
frameworkgroup: C1[X(C12H8O3)]
method: RPBEPBE
basis: SDD
operation: Freq
keyword: #pfreq=noraman
keyword: PBEPBE/SDD
title: #p freq=noraman PBEPBE/SDD
converged: NO YES NO NO
title: Mulliken charges:
elementType: O O O C C C C C C C C C C C C H H H H H H H H
charge: -0.368640 -0.148545 -0.171243 0.223643 0.151942 0.206891 -0.442028 -0.343640 -0.343674 -0.449540 0.068707 0.085417 -0.212875 -0.212872 -0.226761 0.283458 0.259086 0.259140 0.282625 0.240673 0.240687 0.240358 0.377188
chargesum: 0.00000
title: Mulliken charges with hydrogens summed into heavy atoms:
elementType: O O O C C C C C C C C C C C C
charge: 0.008548 -0.148545 -0.171243 0.223643 0.151942 0.206891 -0.158570 -0.084553 -0.084534 -0.166915 0.068707 0.085417 0.027798 0.027815 0.013597
polarizability: 2.14067201e+02 7.72092892e+00 1.08148315e+02 -1.12243386e-02 8.64598827e-02 9.55872469e+01
1716.lowfreq: -56.7978 -8.9844 0.0006 0.0007 0.0008 2.4799 6.4022 47.2297 75.0695
frequency: -56.7553 47.2150 75.0693 83.7107 167.6239 220.2978 237.0226 260.1671 332.9951 364.5042 392.6281 429.4961 437.4312 469.3922 485.3883 510.4920 548.5298 611.8367 631.5978 644.0197 689.6979 704.0411 715.4767 760.4164 768.7833 789.9277 857.8554 868.5684 900.7223 928.5505 955.2899 980.9609 986.9689 1004.6327 1029.9048 1079.8435 1133.6506 1155.9291 1177.5619 1190.8276 1200.9787 1237.8251 1255.1719 1287.3455 1312.9412 1366.0701 1367.9355 1427.8382 1476.2673 1539.3585 1580.7399 1582.0770 1589.5857 1608.4004 1650.7053 3133.9207 3138.0513 3148.6681 3156.7864 3158.7382 3173.0055 3178.9997 3464.7433
redmass: 4.2717 9.3922 5.7060 6.3803 6.3539 5.3835 7.3339 4.6141 14.3222 7.1156 2.8296 10.0771 3.0994 2.7749 4.2651 1.5569 6.5046 6.4549 4.0958 6.7634 7.1551 1.8435 8.9011 2.1117 2.2145 3.1345 1.2416 1.5206 1.8638 1.3859 4.8483 1.3846 6.2908 1.3182 2.0639 1.6205 3.9423 1.5228 1.0538 1.1364 2.6415 2.4928 2.4321 2.1800 1.3828 3.1579 6.4876 2.1798 2.2886 9.9412 5.8390 11.4006 7.3404 6.3544 7.4918 1.0855 1.0884 1.0927 1.0936 1.0968 1.1018 1.0928 1.0651
irintensity: 0.0094 0.4622 0.5890 2.0651 1.5563 2.5214 1.0455 5.7842 2.4312 2.1317 0.1641 7.8944 1.2304 14.8122 19.7065 80.3244 5.3360 0.0640 3.1754 0.0208 6.1364 42.8791 0.0088 70.8809 0.0440 10.0212 0.4128 48.1214 3.7188 2.2819 2.2875 0.2052 3.5784 0.0709 9.1293 6.8460 1.4894 151.8073 0.0105 6.9064 26.2808 15.4194 63.2555 56.4707 0.5113 188.5211 0.0736 10.7220 5.5060 297.4447 1.7520 25.2015 38.5495 12.5927 39.6903 0.8427 0.0068 7.4814 0.5628 20.6561 17.8412 1.0647 205.1790
temp: 298.150 k
press: 1.00000 atm
elementType: 8 8 8 6 6 6 6 6 6 6 6 6 6 6 6 1 1 1 1 1 1 1 1
symmnumber: 1
zpe: 434634.3 jmol-1
zpe.correction: 0.165543 hartree
zpe.thermalcorrener: 0.177043 hartree
zpe.thermalcorrenthalpy: 0.177987 hartree
zpe.thermalcorrgfe: 0.127345 hartree
zpe.sumelectzpe: -686.671726 hartree
zpe.sumelectthermal: -686.660227 hartree
zpe.sumelectthermalent: -686.659283 hartree
zpe.sumelectthermalfe: -686.709924 hartree
dipole: 9.1870 0.8808 -0.0001
dipole: 9.2292
quadrupole: -101.6218 -94.3505 -78.6255
quadrupole: -5.8810 -0.0004 0.0565
quadrupole: -10.0892 -2.8179 12.9071 -5.8810 -0.0004 0.0565
hfenergy: -686.8372694 hartree
pointgroup: C01 [X(C12H8O3)]
dipole: -3.6074166 0.4134742 -0.0010714 debye
dipolederiv: -1.0852399 0.3191701 0.0000017 0.7939606 -0.7076717 -0.0002004 -0.0000734 -0.000405 -0.3403246 -0.5522687 0.2094267 -0.0004541 0.2388263 -0.6524065 0.0005729 0.0002027 0.0000726 -0.2900789 -1.0359044 0.0648645 0.0009554 -0.0126758 -0.3547557 0.0000277 -0.0013387 0.0003229 -0.3010152 0.6329677 0.0234576 0.0002165 0.3201291 0.0470106 -0.0000398 0.0002936 0.0000592 -0.0676788 0.0597117 -0.0136423 0.0000365 -0.1188704 -0.1387675 -0.0003384 -0.0003004 -0.0002095 0.0240419 0.8977195 -0.3966449 -0.0005719 -0.8251745 0.6978902 0.0001159 0.0010964 0.0000203 0.1157846 -0.5197317 0.2523308 -0.0002418 -0.0725706 -0.0984574 -0.0000741 -0.0009174 -0.0001182 -0.0885763 -0.0937496 0.0357285 0.0952869 -0.021266 -0.1335958 -0.0154232 -0.0941873 0.0050241 0.0449215 -0.0936801 0.0359607 -0.0952114 -0.0238648 -0.1336794 0.014891 0.0941427 -0.0057451 0.0449585 -0.831423 0.2422181 0.0000639 0.3463314 -0.2015717 -0.0002112 -0.000251 -0.0001663 -0.1952567 0.876433 -0.4018614 0.0003087 -0.1490064 0.4648517 -0.0004216 -0.0006896 0.0002536 0.2024489 1.1379701 -0.2436263 -0.0003599 -0.5629499 0.4408955 0.0001391 0.0015573 -0.0003184 0.1643378 -0.0345944 0.0081239 -0.1093826 -0.0037022 -0.1265457 -0.0054747 -0.0712746 -0.0157887 0.0776702 -0.0344048 0.0078367 0.1092972 -0.0037238 -0.1267966 0.00456 0.0713629 0.0147638 0.0776424 0.1293063 0.0048203 0.0000177 0.0115488 -0.1434772 -0.0002244 -0.0000386 -0.0001534 -0.0516702 0.0557859 -0.0458777 0.0000354 -0.0857966 0.0145763 0.000067 0.0001507 0.0002039 0.1456682 0.0619583 -0.0065659 -0.0844221 0.0137447 0.1383636 0.0013375 -0.078839 -0.0002809 -0.011752 0.0620093 -0.0069884 0.0843758 0.0135954 0.1384171 -0.0005864 0.0789872 0.0009121 -0.0117822 0.0567419 -0.0337135 0.0000575 0.0033141 -0.0026224 0.0000532 -0.000038 -0.0000792 0.1818006 0.0134107 -0.0000357 0.0751404 -0.0011771 0.1562898 0.0012519 0.0904832 0.0033025 -0.0463844 0.0133943 0.0003076 -0.0751804 -0.000566 0.156285 -0.0003191 -0.0905008 -0.002372 -0.0463776 -0.114629 -0.0069205 -0.0000068 -0.0052854 0.1599359 0.0001572 0.0000016 0.0001519 0.092567 0.398217 -0.0483688 0.0000374 0.1451792 0.4058317 0.0001399 0.0001704 0.0005498 0.2790553 unknown
polarizability: 213.7447027|-9.6781848|108.4703214|0.0141279|-0.1175852|95.5877382 unknown
InChI: InChI=1S/C12H8O3/c13-10-7-12(15)11(14)6-9(10)8-4-2-1-3-5-8/h1-7,13H
charge 0 multiplicity 1
23 atoms
O  -0.022311 2.366888 -0.000644
O  3.114757 -2.197336 0.001581
O  4.328925 0.375355 0.000955
C  0.148851 -0.092642 -0.000112
C  -1.351952 -0.134896 -0.000077
C  0.798262 1.246887 -0.000679
C  0.925978 -1.22293 0.000783
C  -2.069826 -0.153974 1.22643
C  -2.070001 -0.148198 -1.226574
C  2.16573 1.416931 -0.001216
C  2.406541 -1.151003 0.001203
C  3.064091 0.267014 -0.002091
C  -3.482425 -0.199093 1.223573
C  -3.482606 -0.19337 -1.223736
C  -4.190841 -0.218976 -0.000084
H  0.477854 -2.222023 0.001487
H  -1.521234 -0.146706 2.174805
H  -1.521566 -0.136577 -2.175002
H  2.600895 2.420029 -0.001261
H  -4.026265 -0.222129 2.173871
H  -4.026573 -0.212002 -2.174058
H  -5.285412 -0.25616 -0.000093
H  -0.981371 2.096709 -0.000362
