program: Gaussian 09
title: 000276201
version: EM64L-G09RevD.01
frameworkgroup: C1[X(C9H8N4O)]
method: RPBEPBE
basis: SDD
operation: Freq
keyword: #pfreq=noraman
keyword: PBEPBE/SDD
title: #p freq=noraman PBEPBE/SDD
converged: YES YES NO NO
title: Mulliken charges:
elementType: O N N N N C C C C C C C C C H H H H H H H H
charge: -0.259208 -0.047011 -0.005071 -0.374623 -0.503681 0.083677 0.065250 0.090819 -0.335360 -0.306400 -0.382567 -0.211926 -0.214506 0.136460 0.262744 0.266130 0.287466 0.239581 0.239849 0.356245 0.306490 0.305640
chargesum: 0.00000
title: Mulliken charges with hydrogens summed into heavy atoms:
elementType: O N N N N C C C C C C C C C
charge: -0.259208 -0.047011 -0.005071 -0.018378 0.108449 0.083677 0.065250 0.090819 -0.072615 -0.040271 -0.095100 0.027656 0.025344 0.136460
polarizability: 2.13133972e+02 -1.38552185e+01 1.31952424e+02 -7.20754866e-02 -1.24882449e-01 5.34451295e+01
1716.lowfreq: -5.1488 -0.0009 -0.0008 -0.0007 9.2616 11.7981 51.6601 63.2353 80.9719
frequency: 51.6439 63.1809 80.9399 115.7853 162.8196 181.2752 261.4875 276.9245 314.4824 351.6076 410.5238 488.9011 490.2413 492.3614 527.3347 588.6396 609.3289 634.1721 699.1377 747.0175 750.6088 768.2960 781.2459 808.9113 821.1913 889.3138 890.1762 949.2743 960.0691 976.6813 1003.0837 1010.5613 1063.8094 1112.5757 1156.6261 1192.0826 1215.8910 1247.7560 1274.7603 1278.8505 1283.8436 1323.7077 1372.4212 1413.4692 1452.8961 1468.4294 1480.5535 1515.6679 1551.0200 1604.4490 1617.9025 1674.5331 3139.4543 3152.0621 3166.1235 3167.0187 3176.4610 3389.8250 3507.0150 3521.1725
redmass: 2.8496 3.6092 2.0855 5.1315 2.8001 3.7367 5.4678 5.4030 6.1931 5.9951 4.4534 4.3313 3.7787 6.0346 7.1524 7.8317 9.9406 4.5398 1.1710 5.7216 2.6861 1.6038 1.5421 3.0911 7.3416 7.2657 1.7327 1.4580 6.2873 1.3677 1.3343 2.1065 4.0903 1.8070 1.2487 1.7536 3.3054 2.1623 3.0659 2.0825 1.1623 2.8073 2.5083 4.7904 2.3830 2.5042 3.3741 7.4968 6.9636 9.3472 6.6467 1.0627 1.0862 1.0896 1.0958 1.0933 1.1006 1.0427 1.0989 1.0791
irintensity: 27.1122 3.0520 12.1054 1.3864 8.5858 0.0463 13.9327 10.3624 2.4397 28.4578 13.0624 0.0512 2.7576 2.9457 0.2386 1.4454 1.0477 0.9850 125.3455 8.8102 32.1068 113.6695 84.2792 5.0418 28.4422 21.2783 0.0672 12.0348 3.4845 6.7907 0.0050 6.5222 26.8416 12.3262 3.6035 2.4536 5.1056 0.0964 0.1253 7.5439 0.3174 0.5117 26.2237 20.1125 20.9402 196.3744 24.9819 1.8259 17.7562 159.0149 10.6896 25.2486 2.0628 4.8922 11.4284 0.4213 22.0236 0.4479 2.1312 41.3086
temp: 298.150 k
press: 1.00000 atm
elementType: 8 7 7 7 7 6 6 6 6 6 6 6 6 6 1 1 1 1 1 1 1 1
symmnumber: 1
zpe: 428727.2 jmol-1
zpe.correction: 0.163294 hartree
zpe.thermalcorrener: 0.174947 hartree
zpe.thermalcorrenthalpy: 0.175891 hartree
zpe.thermalcorrgfe: 0.124681 hartree
zpe.sumelectzpe: -640.987107 hartree
zpe.sumelectthermal: -640.975454 hartree
zpe.sumelectthermalent: -640.974510 hartree
zpe.sumelectthermalfe: -641.025720 hartree
dipole: 2.8512 -2.6035 0.0600
dipole: 3.8615
quadrupole: -68.0006 -84.9548 -81.2281
quadrupole: -0.4118 -0.2963 -0.1582
quadrupole: 10.0606 -6.8936 -3.1670 -0.4118 -0.2963 -0.1582
hfenergy: -641.1504007 hartree
pointgroup: C01 [X(C9H8N4O1)]
dipole: -1.1739372 -0.963878 -0.029391 debye
dipolederiv: -0.840791 -0.3227236 -0.0044171 0.048691 -0.7827819 -0.005584 -0.0001687 -0.0051996 -0.3546077 -0.0959918 0.0575914 0.0005754 0.0962038 -0.2654229 0.0001496 0.0041082 -0.0018413 -0.2460471 -0.1323951 0.0087736 0.000255 0.107115 -0.1788624 0.0005616 0.0001684 0.0007007 -0.2693539 -0.2410888 0.0726704 0.0028808 0.3875117 -0.7310429 -0.0120893 -0.0009364 -0.0096221 -0.4263523 -0.1332207 0.006614 -0.0019834 0.1401557 -0.4505496 0.0110532 -0.001223 0.0052706 -0.0380869 -0.1390954 -0.012242 -0.0002399 0.507654 0.0384172 0.000311 -0.0004551 0.000965 0.1267471 0.2396785 0.2028963 0.0007176 -0.3688634 -0.1368971 -0.0011497 -0.0005908 -0.0004987 0.1069665 -0.0834092 -0.0095932 -0.0010781 -0.4171769 -0.0364232 -0.0006331 0.0034959 -0.0050936 0.1320549 -0.0505275 -0.0674923 -0.0000249 -0.0095426 0.0895774 0.0007123 -0.0000477 0.0007052 -0.1640123 -0.0990613 -0.1136102 -0.0002551 -0.1249467 0.0965651 0.0007119 0.0001469 0.0003765 -0.1455519 -0.1562824 0.0171469 -0.0003583 0.292037 0.2268651 0.0006117 -0.0028723 0.0021072 0.0298714 -0.088372 0.11319 0.000386 0.1915129 0.1288003 0.0010368 0.0006783 0.0009336 -0.1383721 0.1529643 -0.0737822 0.000126 -0.1421449 -0.0504236 0.0001039 -0.0001853 0.0002308 -0.1378485 1.1384932 0.1142313 0.0017458 -0.3127739 1.2583216 0.0146478 0.0034936 0.0084277 0.1708532 0.0766563 0.0755493 0.0001519 0.0121189 -0.0337426 -0.0005985 -0.0001133 -0.0005028 0.1651288 0.0652 0.0202869 -0.0000538 0.082278 -0.0209813 -0.0004986 0.0000935 -0.0005715 0.163086 0.0817543 -0.0653296 -0.0001774 -0.0640843 0.0684354 -0.0001542 0.0002925 -0.0004888 0.1286019 -0.000103 -0.0979424 -0.0004739 -0.1052537 -0.0264655 -0.0007049 -0.0005294 -0.0007284 0.1608034 -0.1122119 0.0294024 -0.0002086 0.0256695 0.0898191 -0.0001935 -0.0002497 -0.000183 0.1605404 0.2411182 -0.0213726 -0.0006245 -0.0751967 0.2315594 -0.0000834 -0.0108546 0.0091575 0.3412033 0.091733 0.0318817 -0.0198733 -0.1273024 0.2288676 -0.1579685 0.0199309 -0.0945285 0.1262644 0.0849522 0.0338538 0.0229298 -0.143662 0.2563648 0.1497581 -0.0141819 0.0903835 0.1081114 unknown
polarizability: 214.3627332|9.5227507|130.7207237|0.1688317|0.4910864|53.4480688 unknown
InChI: InChI=1S/C9H8N4O/c10-13-9(14)8-5-11-6-3-1-2-4-7(6)12-8/h1-5,13H,10H2
charge 0 multiplicity 1
22 atoms
O  3.426248 1.013972 0.018031
N  0.301163 -0.822545 0.000629
N  -0.73413 1.865824 0.007784
N  2.971661 -1.281826 -0.00623
N  4.325058 -1.708084 0.004208
C  -1.065755 -0.591901 -0.000378
C  -1.586742 0.763997 0.003321
C  1.105515 0.26346 0.005156
C  -1.972109 -1.696828 -0.004833
C  -2.999274 0.972993 0.002409
C  0.586416 1.605345 0.008691
C  -3.349429 -1.462609 -0.005673
C  -3.864618 -0.124657 -0.002032
C  2.600213 0.047642 0.005829
H  -1.556416 -2.709198 -0.007475
H  -3.365151 2.004227 0.005277
H  1.28364 2.447813 0.012371
H  -4.047325 -2.306632 -0.009102
H  -4.948377 0.033175 -0.002737
H  2.2445 -2.002635 -0.005789
H  4.80877 -1.342372 0.837185
H  4.806242 -1.398359 -0.852642
