program: Gaussian 09
title: 000276246
version: EM64L-G09RevD.01
frameworkgroup: C1[X(C15H11Cl2NO2)]
method: RPBEPBE
basis: SDD
operation: Freq
keyword: #p
keyword: freq=noraman
keyword: PBEPBE/SDD
title: #p freq=noraman PBEPBE/SDD
converged: YES YES NO NO
title: Mulliken charges:
elementType: Cl Cl O O N C C C C C C C C C C C C C C C H H H H H H H H H H H
charge: 0.025788 0.016541 -0.456425 -0.231124 -0.412347 -0.314984 -0.035602 0.242593 0.204404 0.160581 0.333022 -0.433569 -0.403346 -0.387028 -0.372424 -0.201674 -0.232216 -0.228150 0.349474 -0.744673 0.270742 0.244758 0.262301 0.244097 0.301108 0.230243 0.232161 0.353496 0.230944 0.388911 0.362398
chargesum: 0.00000
title: Mulliken charges with hydrogens summed into heavy atoms:
elementType: Cl Cl O O N C C C C C C C C C C C C C C C
charge: 0.025788 0.016541 -0.102929 -0.231124 -0.023436 -0.044243 -0.035602 0.242593 0.204404 0.160581 0.333022 -0.188810 -0.141045 -0.142931 -0.071316 0.028568 -0.000056 0.002794 0.349474 -0.382275
polarizability: 2.82953181e+02 -1.80293932e+01 2.20387986e+02 1.54003775e+00 2.95532268e+00 1.10211790e+02
1716.lowfreq: -10.5717 -2.1925 -0.0009 0.0012 0.0016 3.6366 7.1796 34.0226 55.1973
frequency: 3.5735 34.0133 55.1969 60.0514 107.5886 115.7011 131.1365 140.6250 174.3264 209.1810 213.2159 244.3360 258.2476 281.3557 313.8041 382.5952 392.0788 417.2230 425.5924 437.4811 473.1583 513.7562 528.5152 552.9104 592.2129 607.0614 615.0378 632.7636 663.8675 699.9827 731.3769 741.1256 749.3310 763.0828 772.1044 802.3143 816.1355 834.6361 851.0333 879.5007 889.3673 918.6650 956.0077 958.1605 962.0249 990.6674 992.6989 1020.4041 1061.0479 1073.3005 1114.7753 1168.4562 1178.9022 1181.2382 1190.5334 1193.0324 1194.3853 1198.7482 1211.4156 1230.9651 1278.7223 1292.7016 1314.4254 1346.8762 1379.7723 1404.2120 1428.4151 1451.5473 1460.7343 1485.4597 1541.7449 1595.5330 1604.8723 1616.6633 1620.8796 1626.1318 3010.8443 3128.6880 3136.3634 3138.1000 3149.2175 3157.8281 3164.1250 3166.1202 3197.6082 3347.7726 3547.7840
redmass: 13.2622 7.6886 10.7384 10.4277 5.4133 5.0017 6.4210 6.8081 7.7684 6.0185 6.9471 14.2225 4.7776 6.2880 4.6235 6.3987 5.9336 1.4977 2.8714 3.6699 7.0743 5.0584 3.5775 5.7430 9.1011 5.3460 4.3938 5.7090 4.5237 5.8715 5.0692 1.8893 8.9463 5.2769 1.5609 1.8232 1.7289 2.1314 4.5071 2.9682 1.6614 1.4344 1.5086 5.3505 6.3997 1.3375 1.3257 2.1477 2.1554 2.9772 1.7856 1.2153 1.5125 1.2860 1.3930 1.4906 1.3522 1.5788 1.7965 2.0538 1.8876 1.8213 2.5161 1.1754 7.4233 3.3882 3.0477 3.0168 2.8786 3.5154 2.1209 6.7300 6.7608 9.5071 7.2235 4.3788 1.0829 1.0856 1.0877 1.0894 1.0951 1.0961 1.0899 1.1003 1.0948 1.0798 1.0661
irintensity: 0.2818 0.0989 1.3289 0.6229 5.3810 1.4618 2.1777 4.1917 1.5250 3.0591 1.6649 3.5158 1.5742 0.9395 1.5200 3.0788 15.1149 90.3057 14.0257 11.8993 33.0763 2.9206 3.1167 15.2648 95.2898 9.3515 2.5867 6.6794 15.5330 41.0337 17.8521 5.7701 39.3145 25.3723 96.0537 53.1618 6.7997 58.5929 27.5318 12.4610 5.9261 3.0981 6.4470 54.4671 5.8848 2.5008 0.5873 4.2241 4.6271 1.0739 0.7841 2.5722 28.3005 5.5967 7.5301 15.4205 6.7024 6.1691 4.4254 16.2261 3.8389 11.8978 42.2007 24.9309 5.5439 6.2436 104.9153 25.7027 14.4958 60.7113 275.0707 2.7997 140.0447 299.0913 8.3299 58.8917 5.8393 2.0507 9.3439 0.3456 17.3630 23.9319 0.7510 32.0132 3.8603 126.9706 10.5965
temp: 298.150 k
press: 1.00000 atm
elementType: 17 17 8 8 7 6 6 6 6 6 6 6 6 6 6 6 6 6 6 6 1 1 1 1 1 1 1 1 1 1 1
symmnumber: 1
zpe: 589131.9 jmol-1
zpe.correction: 0.224389 hartree
zpe.thermalcorrener: 0.241630 hartree
zpe.thermalcorrenthalpy: 0.242574 hartree
zpe.thermalcorrgfe: 0.175692 hartree
zpe.sumelectzpe: -1702.140676 hartree
zpe.sumelectthermal: -1702.123435 hartree
zpe.sumelectthermalent: -1702.122490 hartree
zpe.sumelectthermalfe: -1702.189372 hartree
dipole: 4.3362 -0.3555 0.9266
dipole: 4.4484
quadrupole: -119.9971 -126.5342 -131.7227
quadrupole: 1.6034 0.2916 0.9078
quadrupole: 6.0876 -0.4496 -5.6380 1.6034 0.2916 0.9078
hfenergy: -1702.3650646 hartree
pointgroup: C01 [X(C15H11Cl2N1O2)]
dipole: 1.7228236 -0.0864144 -0.295526 debye
polarizability: 286.6386785|6.5631642|213.832354|8.293056|16.6599215|113.0819241 unknown
InChI: InChI=1S/C15H11Cl2NO2/c16-14(17)15(20)18-11-7-3-6-9-8-4-1-2-5-10(8)13(19)12(9)11/h1-7,13-14,18-19H
charge 0 multiplicity 1
31 atoms
Cl -4.08405 2.062969 1.613666
Cl -3.974453 2.349561 -1.449126
O  0.099691 2.133669 -0.380612
O  -3.994573 -1.20798 -0.144896
N  -2.06906 0.157664 -0.093959
C  0.73063 1.067616 0.440213
C  0.289993 -0.340565 0.056776
C  1.411817 -1.200936 -0.062628
C  2.253159 0.96682 0.375179
C  2.636988 -0.385667 0.125057
C  -1.025329 -0.809031 -0.141593
C  1.228523 -2.572556 -0.336086
C  3.213989 1.971862 0.562547
C  4.000897 -0.738176 0.073099
C  -1.219462 -2.193965 -0.411289
C  -0.096223 -3.049425 -0.494274
C  4.587059 1.61872 0.493531
C  4.972685 0.276283 0.257435
C  -3.424581 -0.076944 -0.097822
C  -4.311457 1.174147 -0.022176
H  0.39368 1.329964 1.461365
H  2.078829 -3.256578 -0.423871
H  2.911489 3.007131 0.753879
H  4.311408 -1.772765 -0.109523
H  -2.230221 -2.581811 -0.548781
H  -0.264467 -4.112275 -0.699982
H  5.355173 2.387896 0.628871
H  0.441612 2.063181 -1.309294
H  6.03727 0.020425 0.215499
H  -1.742561 1.139052 -0.117574
H  -5.367154 0.88951 -0.086629
