program: Gaussian 09
title: 000270692
version: EM64L-G09RevD.01
frameworkgroup: C1[X(C16H13Br2NO2)]
method: RPBEPBE
basis: SDD
operation: Freq
keyword: #p
keyword: freq=noraman
keyword: PBEPBE/SDD
title: #p freq=noraman PBEPBE/SDD
converged: YES YES NO NO
title: Mulliken charges:
elementType: Br Br O O N C C C C C C C C C C C C C C C C H H H H H H H H H H H H H
charge: -0.003416 0.009525 -0.291948 -0.259506 -0.687811 -0.707804 0.304677 0.410907 0.186599 0.229222 -0.544758 -0.690484 -0.378042 -0.416010 0.248888 0.831689 -0.374526 -0.495967 0.152133 -0.217424 -0.675209 0.266170 0.266151 0.283672 0.243235 0.261519 0.270981 0.325058 0.325070 0.228566 0.228762 0.212093 0.229004 0.228985
chargesum: 0.00000
title: Mulliken charges with hydrogens summed into heavy atoms:
elementType: Br Br O O N C C C C C C C C C C C C C C C C
charge: -0.003416 0.009525 -0.291948 -0.259506 -0.037683 -0.175484 0.304677 0.410907 0.186599 0.229222 -0.261086 -0.690484 -0.134807 -0.154491 0.248888 0.831689 -0.103545 -0.495967 0.152133 0.239904 -0.005127
polarizability: 4.30454682e+02 7.61828222e+00 2.54024703e+02 6.66328706e-02 -3.20808104e-03 9.20782055e+01
1716.lowfreq: -2.9763 -2.3010 -1.7213 -0.0004 0.0001 0.0007 18.2626 37.8438 55.0607
frequency: 18.0959 37.8361 55.0585 61.3811 82.3259 90.8499 98.6447 100.1012 122.7953 149.9377 199.5755 208.3618 210.5098 245.5511 266.8220 268.1270 277.2187 280.0487 308.8800 342.1115 369.1750 416.4139 431.7166 433.0010 460.0913 477.5176 501.5325 513.7284 520.8583 585.6703 591.4361 631.8000 633.1739 695.5015 703.3746 737.2116 748.8793 770.3786 777.5744 784.5834 798.5272 831.6730 856.5927 887.1140 906.5742 908.6670 967.6656 970.9643 990.8974 1010.6590 1023.6416 1058.1526 1062.9714 1110.8504 1116.7295 1133.4579 1135.9505 1166.8564 1171.1231 1208.6287 1234.9657 1249.3842 1256.0997 1285.9226 1331.6994 1359.1026 1364.0937 1379.7759 1400.2309 1424.1587 1440.5084 1450.0506 1463.7830 1467.7944 1473.5464 1479.7017 1487.2082 1554.7055 1581.6760 1603.4362 1611.5312 1622.3030 1634.5094 2986.5712 2994.7074 3008.1366 3029.9615 3065.8943 3091.3107 3105.6837 3136.0868 3162.3123 3164.5201 3165.3227 3534.8750 3678.1444
redmass: 3.7339 3.8286 6.1276 4.9806 5.8750 4.8712 3.5584 7.1202 18.5765 3.6886 16.3535 2.8057 6.3580 1.4741 6.8705 3.5864 6.7846 2.9700 5.6604 4.3340 5.5092 5.1004 2.8787 4.6289 1.0435 1.2442 4.6696 5.3585 3.6837 3.9485 6.2593 4.6588 8.0761 7.7004 4.6106 6.0057 5.7459 3.8384 6.9703 6.3759 1.1030 3.6479 1.4798 1.5607 1.6416 4.1898 1.8721 2.9448 1.3711 8.2784 2.3278 4.0540 1.7848 2.2094 2.2321 1.1451 1.4680 1.6487 2.8848 1.6017 1.7360 1.1327 2.7350 1.5790 4.5989 1.4781 4.1577 6.2094 1.2734 1.1719 4.8373 4.9416 1.0404 4.3214 1.0612 4.2127 1.0840 7.0834 7.2892 2.8296 6.3358 4.4589 2.4329 1.0611 1.0357 1.0581 1.0990 1.1065 1.0985 1.1026 1.0892 1.0941 1.0929 1.0943 1.0450 1.1042
irintensity: 0.4866 0.0419 0.2663 0.9068 1.0039 0.0556 0.0487 0.3169 0.1678 8.2052 0.2639 0.6429 4.6278 1.3617 3.8194 2.6710 2.1193 6.6905 4.6587 13.3804 9.2460 11.8962 14.1598 0.8393 0.1174 256.7142 0.0370 8.1451 3.8132 1.5002 13.3405 2.2182 17.8704 29.7479 27.9941 14.6013 0.3821 20.6376 14.3948 13.6914 2.1903 0.1777 37.0973 8.7875 0.3280 32.6652 16.9350 26.4621 0.3122 36.7730 34.6905 386.3240 46.4300 44.6058 90.2824 0.0209 5.4854 120.5793 40.4036 59.4965 66.0929 0.0002 357.6547 59.8877 34.6718 6.3293 126.1291 8.8935 21.0605 10.6025 0.5041 2.5882 12.1429 220.5698 7.6783 8.0369 11.1715 26.9156 64.8572 30.3848 404.3276 242.2235 152.1327 6.3310 23.4171 27.3382 3.8313 8.4896 36.7660 46.0347 7.7671 5.0056 0.8162 1.4963 158.6498 51.9795
temp: 298.150 k
press: 1.00000 atm
elementType: 35 35 8 8 7 6 6 6 6 6 6 6 6 6 6 6 6 6 6 6 6 1 1 1 1 1 1 1 1 1 1 1 1 1
symmnumber: 1
zpe: 656781.3 jmol-1
zpe.correction: 0.250155 hartree
zpe.thermalcorrener: 0.270018 hartree
zpe.thermalcorrenthalpy: 0.270963 hartree
zpe.thermalcorrgfe: 0.198907 hartree
zpe.sumelectzpe: -848.182950 hartree
zpe.sumelectthermal: -848.163086 hartree
zpe.sumelectthermalent: -848.162142 hartree
zpe.sumelectthermalfe: -848.234198 hartree
dipole: 1.8478 2.8725 -0.0002
dipole: 3.4155
quadrupole: -122.2571 -138.3044 -144.8501
quadrupole: -11.5699 0.0015 0.0012
quadrupole: 12.8801 -3.1672 -9.7129 -11.5699 0.0015 0.0012
hfenergy: -848.4331048 hartree
pointgroup: C01 [X(C16H13Br2N1O2)]
dipole: -0.770219 1.1007825 -0.0261725 debye
polarizability: 430.6368831|-1.0036091|253.4636843|-6.9267466|-6.1654053|92.4570228 unknown
InChI: InChI=1S/C16H13Br2NO2/c1-2-21-16(20)8-3-4-10-9(5-8)6-12-11(10)7-13(17)15(19)14(12)18/h3-5,7H,2,6,19H2,1H3
charge 0 multiplicity 1
34 atoms
Br -3.533007 3.268561 -0.104046
Br -5.59049 -2.208503 0.146567
O  4.597897 0.60836 -0.172131
O  4.790795 -1.714336 -0.085585
N  -5.658111 0.936475 0.027642
C  -0.596571 1.583733 -0.099565
C  0.427951 0.455176 -0.077289
C  -1.919831 0.837731 -0.043982
C  -0.238448 -0.809949 -0.014947
C  -1.687924 -0.573064 0.005514
C  1.825357 0.527294 -0.109435
C  -3.227079 1.324184 -0.036225
C  0.507236 -2.011461 0.016018
C  -2.774552 -1.472341 0.061712
C  2.577218 -0.681732 -0.078803
C  -4.364887 0.453015 0.020027
C  1.913093 -1.938318 -0.016243
C  -4.076807 -0.951064 0.067851
C  4.064637 -0.68681 -0.110495
C  6.08793 0.691215 -0.205107
C  6.446552 2.172096 -0.27669
H  -0.481813 2.274428 0.758528
H  -0.51781 2.206486 -1.012004
H  2.35441 1.483297 -0.157556
H  0.008293 -2.985317 0.064286
H  -2.617609 -2.553638 0.09983
H  2.527469 -2.84435 0.006034
H  -5.828578 1.938696 -0.00751
H  -6.444211 0.291943 0.068714
H  6.483885 0.202236 0.703543
H  6.449406 0.124381 -1.082321
H  7.545456 2.288711 -0.301342
H  6.028003 2.636271 -1.18616
H  6.059637 2.714997 0.602672
