program: Gaussian 09
title: 000270690
version: EM64L-G09RevD.01
frameworkgroup: C1[X(C16H15NO2)]
method: RPBEPBE
basis: SDD
operation: Freq
keyword: #p
keyword: freq=noraman
keyword: PBEPBE/SDD
title: #p freq=noraman PBEPBE/SDD
converged: YES YES NO NO
title: Mulliken charges:
elementType: O O N C C C C C C C C C C C C C C C C H H H H H H H H H H H H H H H
charge: -0.293989 -0.266982 -0.702509 -0.704967 0.290296 0.325447 0.207358 0.182553 -0.542136 -0.646313 -0.398839 -0.376953 0.250976 -0.373107 0.541964 -0.446826 0.153586 -0.255729 -0.667146 0.244977 0.244736 0.280371 0.239971 0.233375 0.237065 0.267213 0.217945 0.308626 0.308343 0.217496 0.232898 0.213580 0.252707 0.224013
chargesum: 0.00000
title: Mulliken charges with hydrogens summed into heavy atoms:
elementType: O O N C C C C C C C C C C C C C C C C
charge: -0.293989 -0.266982 -0.085541 -0.215253 0.290296 0.325447 0.207358 0.182553 -0.261765 -0.412937 -0.158867 -0.139888 0.250976 -0.105894 0.541964 -0.228881 0.153586 0.194665 0.023154
polarizability: 3.97023805e+02 1.13021820e+01 1.83323883e+02 -6.52215954e+00 4.80031350e+00 8.84572891e+01
1716.lowfreq: -2.9725 -0.0007 -0.0005 -0.0004 0.6152 5.8932 34.5155 42.2122 64.3149
frequency: 34.5005 42.1557 64.3117 86.2183 100.2306 118.6232 164.3376 174.1991 214.1416 229.1189 242.3522 267.6983 314.2092 351.2344 362.1053 372.7560 378.7446 379.3922 422.5372 437.8276 450.5052 469.0952 518.1312 525.3025 561.8123 590.7669 597.6541 663.2684 691.7629 721.9281 728.4605 729.7922 762.8092 772.5758 810.8915 819.5060 827.5277 853.8656 858.5378 898.8781 912.4510 927.1590 946.2032 971.9769 988.9663 993.3553 1006.2007 1033.2529 1051.4681 1095.3579 1106.8277 1132.4564 1133.8523 1154.4166 1157.3218 1166.6222 1200.6003 1222.5664 1262.0396 1280.5821 1286.9417 1309.4257 1333.5755 1357.5061 1381.8273 1387.0303 1390.5997 1425.9424 1445.2634 1455.1726 1462.7605 1469.5778 1471.7715 1485.1546 1500.5246 1577.8237 1589.3134 1609.2657 1621.5752 1638.3695 1645.3685 2983.1504 2991.6886 3025.8865 3027.4410 3085.9196 3090.7514 3116.6238 3117.0148 3119.6911 3134.2219 3144.5480 3160.5485 3163.8390 3565.3710 3705.9063
redmass: 4.1921 3.3117 5.6760 4.9500 3.2583 4.5543 4.4036 3.6311 1.4069 2.4953 3.2655 4.0643 3.0097 4.0875 3.6806 2.0113 1.1500 1.8417 2.5919 2.8380 3.8762 5.0031 3.5508 4.1057 5.6379 3.1006 6.2004 5.8620 4.0273 5.4056 3.5778 3.5706 4.7644 3.5446 1.4049 1.5358 3.3911 1.5723 1.5185 3.7633 1.5715 2.7845 1.3861 1.9560 1.3714 6.4429 2.6206 1.4740 3.8928 2.1385 2.2408 1.1511 1.7386 1.6682 1.3699 1.7223 1.6255 1.7424 2.4538 1.1215 1.5373 2.0037 3.5653 1.3086 5.5163 4.3371 1.2394 1.1696 3.2126 1.2196 1.0449 3.1039 4.4352 1.0540 4.3664 7.5792 6.6756 9.2406 7.4583 2.0723 1.9506 1.0607 1.0363 1.0591 1.0994 1.0977 1.1034 1.1051 1.0912 1.0876 1.0888 1.0968 1.0945 1.0937 1.0449 1.1040
irintensity: 1.1828 0.2447 0.3921 0.5652 0.3206 3.4436 1.4759 0.9214 3.2160 7.1840 2.8757 0.5811 20.1174 9.3446 11.1744 163.5202 5.3845 138.8141 4.0204 0.1807 2.3775 17.6711 0.0783 1.0851 1.2692 1.9294 3.0096 1.8139 3.1418 2.1437 16.0482 19.6817 2.6068 8.6370 1.9014 47.1966 1.0566 48.5738 4.5268 16.6485 0.0026 4.3197 0.6201 22.5907 0.0492 0.5500 11.9913 1.5586 398.8018 50.9590 115.4385 0.0341 5.6979 60.5896 17.3471 61.5324 7.6681 256.9633 173.3006 0.4808 85.8027 43.1442 136.6828 24.3003 13.4682 43.7074 23.7123 17.1006 4.8871 57.6407 15.3929 15.2222 125.3991 13.1214 13.0506 37.6905 45.2526 578.9985 173.4712 2.8404 338.4678 14.3788 28.5847 45.6854 7.9811 45.6989 3.3808 28.9134 19.7882 27.7195 5.5709 27.4710 8.9546 0.2112 142.9739 21.2643
temp: 298.150 k
press: 1.00000 atm
elementType: 8 8 7 6 6 6 6 6 6 6 6 6 6 6 6 6 6 6 6 1 1 1 1 1 1 1 1 1 1 1 1 1 1 1
symmnumber: 1
zpe: 709570.0 jmol-1
zpe.correction: 0.270261 hartree
zpe.thermalcorrener: 0.286985 hartree
zpe.thermalcorrenthalpy: 0.287929 hartree
zpe.thermalcorrgfe: 0.225565 hartree
zpe.sumelectzpe: -822.601475 hartree
zpe.sumelectthermal: -822.584751 hartree
zpe.sumelectthermalent: -822.583807 hartree
zpe.sumelectthermalfe: -822.646171 hartree
dipole: -5.0222 -3.0849 0.1959
dipole: 5.8973
quadrupole: -73.6116 -100.8452 -116.0817
quadrupole: -6.3379 -0.5564 1.5651
quadrupole: 23.2346 -3.9990 -19.2356 -6.3379 -0.5564 1.5651
hfenergy: -822.8717362 hartree
pointgroup: C01 [X(C16H15N1O2)]
dipole: -1.9977077 1.1562257 0.2354667 debye
polarizability: 397.4843885|-7.3207954|175.7566703|-1.6508617|25.6664554|95.563918 unknown
InChI: InChI=1S/C16H15NO2/c1-2-19-16(18)10-3-5-14-11(7-10)8-12-9-13(17)4-6-15(12)14/h3-7,9H,2,8,17H2,1H3
charge 0 multiplicity 1
34 atoms
O  4.072993 0.930459 0.413118
O  4.383098 -1.281096 -0.272797
N  -6.171111 0.828627 0.159003
C  -1.162151 1.646444 0.519914
C  -0.081749 0.611661 0.219945
C  -2.453871 0.879621 0.254383
C  -0.690769 -0.623703 -0.176566
C  -2.14848 -0.456581 -0.155305
C  1.309989 0.736987 0.287442
C  -3.77828 1.320109 0.363809
C  0.116055 -1.740001 -0.505649
C  -3.200001 -1.352934 -0.456934
C  2.121799 -0.387059 -0.043557
C  1.516626 -1.613883 -0.436591
C  -4.842078 0.415785 0.059159
C  -4.53432 -0.919617 -0.350453
C  3.605122 -0.330467 0.005435
C  5.5548 1.093926 0.470489
C  6.113357 1.484871 -0.90132
H  -1.105195 2.009855 1.564739
H  -1.070312 2.538437 -0.130398
H  1.791906 1.671772 0.587713
H  -0.336563 -2.690102 -0.809723
H  -4.00815 2.34576 0.678571
H  -2.988213 -2.380811 -0.772573
H  2.1737 -2.454671 -0.682673
H  -5.355167 -1.609096 -0.582882
H  -6.403842 1.773477 0.449789
H  -6.931914 0.190031 -0.052863
H  5.700126 1.890287 1.21854
H  6.000134 0.148205 0.826467
H  7.1984 1.684821 -0.821918
H  5.965681 0.668163 -1.627391
H  5.620478 2.396128 -1.282121
