program: Gaussian 09
title: 000270688
version: EM64L-G09RevD.01
frameworkgroup: C1[X(C6H4BrF2N)]
method: RPBEPBE
basis: SDD
operation: Freq
keyword: #p
keyword: freq=noraman
keyword: PBEPBE/SDD
title: #p freq=noraman PBEPBE/SDD
converged: NO NO NO NO
title: Mulliken charges:
elementType: Br F F N C C C C C C H H H H
charge: 0.056151 -0.185450 -0.202809 -0.694746 0.730348 -0.707158 -0.587569 0.535768 0.434153 -0.567731 0.256823 0.287522 0.325009 0.319690
chargesum: 0.00000
title: Mulliken charges with hydrogens summed into heavy atoms:
elementType: Br F F N C C C C C C
charge: 0.056151 -0.185450 -0.202809 -0.050048 0.730348 -0.707158 -0.330746 0.535768 0.434153 -0.280209
polarizability: 1.24736075e+02 4.27085071e+00 9.82855061e+01 -3.32022766e-03 7.77690080e-04 3.35848919e+01
1716.lowfreq: -6.8858 -6.7397 0.0003 0.0004 0.0004 8.6702 83.6766 177.1197 198.5230
frequency: 83.6708 177.1191 198.5224 228.7917 241.7112 303.3211 305.0219 349.2859 415.7888 470.0166 497.2682 549.4333 568.4789 573.3348 577.6992 603.6391 726.5057 797.3355 853.6409 957.3645 1010.1555 1023.1703 1075.0262 1116.0428 1212.7719 1357.8105 1392.3351 1454.1470 1486.4888 1587.4241 1625.3307 1644.9864 3168.1777 3202.7643 3549.2807 3696.1258
redmass: 12.4157 13.4920 8.2262 4.3673 12.2931 8.6109 5.3695 6.1564 1.1440 1.1593 6.9568 4.6755 9.1983 5.8500 3.5243 3.5639 2.5082 1.5995 2.2905 4.3916 8.3663 3.3402 1.9285 1.4980 1.5006 5.0679 7.7098 4.8016 5.1840 7.2820 1.6692 2.6867 1.0928 1.0942 1.0460 1.1034
irintensity: 0.3117 0.5142 2.1591 1.9606 1.0247 2.5393 14.6147 3.0350 61.7977 221.6637 4.8786 1.6599 9.8589 22.7646 3.4531 15.7532 2.3502 6.0001 105.9567 27.6383 47.5684 20.2148 81.3486 39.8277 31.3320 15.0927 22.9029 51.9782 41.3997 110.6757 2.6004 475.1511 1.0377 4.4187 75.1855 42.4394
temp: 298.150 k
press: 1.00000 atm
elementType: 35 9 9 7 6 6 6 6 6 6 1 1 1 1
symmnumber: 1
zpe: 233750.2 jmol-1
zpe.correction: 0.089031 hartree
zpe.thermalcorrener: 0.098101 hartree
zpe.thermalcorrenthalpy: 0.099045 hartree
zpe.thermalcorrgfe: 0.054012 hartree
zpe.sumelectzpe: -498.212773 hartree
zpe.sumelectthermal: -498.203703 hartree
zpe.sumelectthermalent: -498.202759 hartree
zpe.sumelectthermalfe: -498.247792 hartree
dipole: 0.6301 3.8090 0.0045
dipole: 3.8608
quadrupole: -70.4262 -54.9278 -68.7235
quadrupole: 2.4692 0.0027 0.0148
quadrupole: -5.7337 9.7647 -4.0310 2.4692 0.0027 0.0148
hfenergy: -498.3018041 hartree
pointgroup: C01 [X(C6H4Br1F2N1)]
dipole: -0.2510509 1.4980494 -0.0011149 debye
dipolederiv: -0.5082424 -0.0415081 0.0000221 0.0030081 -0.0421296 0.0000073 -0.0000323 0.0000023 0.0215838 -0.3364505 -0.3345836 -0.0000974 -0.2494098 -0.8262201 -0.0002125 -0.0000291 -0.0002486 -0.1375599 -1.1513502 0.0352093 0.0001458 -0.0095487 -0.2294065 -0.0000261 0.0001535 -0.0000243 -0.1544059 -0.4253982 0.5314524 0.0004397 0.4875659 -1.1761279 -0.0010145 0.0008886 -0.0022645 -0.7114773 0.2109518 -0.6442945 -0.0005683 -0.4389352 1.264159 0.0010008 -0.0002947 0.0009606 0.2320277 0.8002656 0.0044074 -0.0000226 0.3031738 -0.6154702 -0.0002683 -0.000026 -0.0001082 -0.2660018 -0.3603178 0.4269799 0.0002458 0.0447566 -0.335034 -0.0000323 0.0001099 -0.0000408 -0.273626 0.5882123 0.2749106 -0.0000213 -0.1091935 1.0842382 0.0003855 -0.0001267 0.0003561 0.2032101 1.3199975 -0.0727899 -0.0002091 0.1112947 0.7605923 0.0002565 -0.0001953 0.0002635 0.1512679 -0.5823346 -0.1206882 0.0000389 -0.0686003 -0.4198422 -0.0001142 0.0000774 -0.000101 -0.261526 0.0401341 -0.0357102 0.0000206 -0.0531796 -0.0212515 -0.0000834 -0.0000114 -0.0001409 0.2046878 0.067291 0.0291362 0.0000231 0.0209746 0.0563781 -0.0000542 0.000007 -0.0000307 0.225758 0.2084819 -0.0314301 -0.0001817 0.0002172 0.2540257 -0.0000236 -0.0005185 0.0004829 0.3784351 0.1287596 -0.0210912 0.0001643 -0.0421239 0.2460886 0.0001789 -0.0000023 0.0008937 0.3876265 unknown
polarizability: 124.7538697|-4.2153369|98.2676985|-0.0144241|0.0263549|33.5849043 unknown
InChI: InChI=1S/C6H4BrF2N/c7-6-4(9)1-3(8)2-5(6)10/h1-2H,10H2
charge 0 multiplicity 1
14 atoms
Br -3.024296 -0.034696 0.000467
F  -1.052802 -2.413621 -0.000511
F  3.115212 -0.009908 -0.000198
N  -1.05601 2.457855 0.001872
C  -0.374992 1.252187 0.000849
C  -1.074413 0.005018 0.000417
C  1.051693 1.222301 0.00058
C  -0.351893 -1.202173 -0.000121
C  1.709939 -0.011964 0.000008
C  1.051433 -1.252925 -0.000352
H  1.630624 2.150522 0.000943
H  1.588315 -2.203212 -0.00076
H  -2.073558 2.471914 0.000938
H  -0.550752 3.338802 0.000667
