program: Gaussian 09
title: 000270686
version: EM64L-G09RevD.01
frameworkgroup: C1[X(C22H21N3O)]
method: RPBEPBE
basis: SDD
operation: Freq
keyword: #p
keyword: freq=noraman
keyword: PBEPBE/SDD
title: #p freq=noraman PBEPBE/SDD
converged: YES YES NO NO
title: Mulliken charges:
elementType: O N N N C C C C C C C C C C C C C C C C C C C C C C H H H H H H H H H H H H H H H H H H H H H
charge: -0.253981 -0.438870 -0.113450 -0.114718 0.369326 0.352226 0.498376 -0.534949 -0.376227 -0.387294 0.487527 -0.377539 -0.365504 -0.469301 -0.367298 0.153824 -0.391227 -0.373202 -0.367552 -0.314794 0.158419 -0.345750 -0.299468 -0.669796 0.213002 -0.799812 0.211429 0.211805 0.237424 0.238134 0.235429 0.237046 0.218013 0.308209 0.234876 0.232121 0.247938 0.273249 0.248393 0.272507 0.223868 0.218434 0.224108 0.310040 0.236775 0.270393 0.237842
chargesum: 0.00000
title: Mulliken charges with hydrogens summed into heavy atoms:
elementType: O N N N C C C C C C C C C C C C C C C C C C C C C C
charge: -0.253981 -0.128830 -0.113450 -0.114718 0.369326 0.352226 0.498376 -0.111715 -0.138803 -0.149160 0.487527 -0.142110 -0.128458 -0.251289 -0.059089 0.153824 -0.156351 -0.141081 -0.119614 -0.041545 0.158419 -0.097358 -0.026961 -0.003386 0.213002 -0.054802
polarizability: 7.99740326e+02 -1.27683759e+01 2.38490507e+02 -3.76324935e+00 5.31372880e+00 1.27124367e+02
1716.lowfreq: -85.4654 -3.4831 -2.8521 -0.0015 0.0014 0.0020 1.3220 14.9481 20.6531
frequency: -85.4568 14.9100 20.3697 26.9343 32.9025 44.0013 53.0128 65.5932 81.5428 87.9365 113.2196 132.4689 148.3368 163.1897 193.3533 210.8599 243.7797 253.3779 280.8709 299.6317 328.4046 353.6393 379.1301 396.3489 403.6813 411.1415 418.7885 422.5448 443.4703 498.3388 512.5139 527.5616 545.8040 562.1712 576.4552 583.2950 623.6337 632.3545 636.8890 643.1021 646.2637 708.7032 728.8249 742.5289 754.4305 760.6808 787.1619 820.2075 824.1276 829.8913 842.2969 848.2568 851.9240 859.3410 872.4013 900.7145 929.3013 948.7641 967.4057 972.6079 974.7845 983.4359 989.0525 991.1767 991.5386 992.3836 1002.4684 1003.6468 1024.4510 1030.3023 1042.6712 1057.9299 1111.5648 1117.1854 1129.3247 1139.7462 1160.6675 1191.3499 1200.7352 1216.2616 1219.8600 1240.3263 1244.0403 1266.6725 1294.3182 1298.9397 1301.7126 1309.0335 1309.8642 1335.5560 1350.0120 1374.3151 1376.4935 1386.0777 1388.9150 1417.4185 1420.2117 1429.0146 1447.9790 1467.8383 1471.6027 1472.0854 1476.7710 1485.8430 1490.3696 1495.1303 1521.6143 1560.3476 1572.2819 1585.1493 1607.3346 1611.1564 1624.7017 1635.5149 2980.8039 2987.2433 2988.1596 3040.1942 3072.0740 3080.1237 3085.8627 3109.7719 3118.4668 3125.9424 3134.5672 3136.9943 3137.0666 3143.0662 3149.9735 3159.0811 3162.3296 3165.7572 3168.8602 3196.1180 3518.8100
redmass: 1.0452 4.8292 3.0916 4.7430 3.5670 4.4772 4.6578 4.3688 4.2984 4.8762 4.7678 5.3827 5.8233 4.9192 3.6627 1.5237 3.4485 4.1490 6.3024 3.9637 5.2444 2.4660 4.6530 4.2862 3.2133 3.0157 3.3214 4.2906 4.6310 4.2755 3.9072 4.2216 2.8003 3.4587 2.6922 2.8016 6.9803 6.7836 6.3462 1.1923 5.7280 5.1224 3.6543 3.9731 3.9242 3.6233 1.1659 5.0394 1.7039 2.9481 1.3746 1.3007 1.3561 1.5466 1.7123 7.1395 6.4385 1.3823 2.3569 1.3703 1.3753 1.7156 3.5759 1.4987 1.3570 1.3826 2.6341 2.6933 2.2619 1.6608 1.4522 2.0222 1.3914 1.2689 1.3886 2.0910 1.2720 1.3192 1.3503 2.2444 3.0550 1.2834 2.8476 1.8340 2.7306 1.3994 1.3566 1.5204 1.5211 3.8076 5.6217 3.6980 1.4688 4.9773 1.2250 3.3889 3.4795 4.5462 1.1649 1.0470 1.0664 1.1770 1.9851 1.6997 1.2968 2.0845 3.1274 5.9483 6.9080 5.3633 6.0830 6.3843 5.9693 5.3458 1.0348 1.0385 1.0598 1.1018 1.0984 1.1002 1.1013 1.0888 1.0896 1.0889 1.0890 1.0882 1.0977 1.0897 1.0941 1.0953 1.0959 1.0942 1.0951 1.0947 1.0764
irintensity: 0.0140 1.0434 1.0387 0.4035 0.3754 0.6858 4.6731 2.5996 2.6211 3.4668 0.2156 0.4739 1.5189 3.2066 0.3667 0.2700 0.5199 1.6545 4.4325 1.2720 2.3537 2.6945 0.3095 0.8591 0.6437 2.6078 0.6213 3.0310 2.9453 9.8760 35.6219 11.5402 24.0052 1.5718 25.5263 1.1466 0.4812 1.0375 0.6588 59.9840 8.2403 9.2400 4.8195 0.6443 3.5603 2.4022 2.6358 2.5393 41.0789 19.7183 4.8349 0.4888 29.6737 105.9050 12.7924 0.2575 9.1105 1.2743 10.7153 1.5711 2.2420 56.6315 7.9432 3.3571 0.9461 1.3238 6.6608 0.0765 1.6277 8.0223 10.5159 57.3621 2.8174 14.7380 13.7154 2.1024 114.2465 26.5317 29.0191 0.3446 157.1143 0.7096 17.6055 55.1457 23.5856 9.0641 2.2523 42.5234 0.9470 189.1014 36.0758 23.4447 107.6474 5.6459 8.7844 43.2525 54.1767 5.7691 65.7593 20.0869 13.1279 9.0079 22.0293 12.5229 3.4844 554.4474 173.1906 6.5020 4.5517 97.1239 129.8067 116.9894 52.9360 124.8371 55.4147 10.3977 53.6943 8.2612 15.2068 80.4458 37.7209 39.0208 28.5621 34.4406 7.2405 21.4313 6.1516 12.9083 6.3552 14.1685 14.1567 8.5837 3.7366 4.3882 14.4115
temp: 298.150 k
press: 1.00000 atm
elementType: 8 7 7 7 6 6 6 6 6 6 6 6 6 6 6 6 6 6 6 6 6 6 6 6 6 6 1 1 1 1 1 1 1 1 1 1 1 1 1 1 1 1 1 1 1 1 1
symmnumber: 1
zpe: 983700.2 jmol-1
zpe.correction: 0.374672 hartree
zpe.thermalcorrener: 0.397775 hartree
zpe.thermalcorrenthalpy: 0.398719 hartree
zpe.thermalcorrgfe: 0.318335 hartree
zpe.sumelectzpe: -1088.590482 hartree
zpe.sumelectthermal: -1088.567378 hartree
zpe.sumelectthermalent: -1088.566434 hartree
zpe.sumelectthermalfe: -1088.646818 hartree
dipole: -1.0865 3.4688 -0.8405
dipole: 3.7309
quadrupole: -91.7515 -144.0855 -159.4096
quadrupole: -30.1264 8.6701 2.7837
quadrupole: 39.9974 -12.3366 -27.6607 -30.1264 8.6701 2.7837
hfenergy: -1088.9651532 hartree
pointgroup: C01 [X(C22H21N3O1)]
dipole: -0.4637026 0.309148 -1.3579219 debye
polarizability: 799.1874841|-22.3312159|153.2812061|-9.0408065|-46.67176|212.88651 unknown
InChI: InChI=1S/C22H21N3O/c1-3-17-4-10-21(11-5-17)24-25-22-14-8-19(9-15-22)18-6-12-20(13-7-18)23-16(2)26/h4-15,23H,3H2,1-2H3
charge 0 multiplicity 1
47 atoms
O  -7.901294 -0.212031 2.167542
N  -7.412392 0.215844 -0.090535
N  2.628751 0.257562 -0.695297
N  3.32078 -0.482996 0.137522
C  -3.127574 0.195113 -0.276019
C  -1.644106 0.192079 -0.362621
C  7.587763 -0.413846 -0.187653
C  9.106677 -0.375623 -0.244745
C  -3.935443 0.419614 -1.426661
C  -3.799952 -0.025607 0.958397
C  -5.990274 0.199863 -0.100213
C  -0.960328 0.977802 -1.334259
C  -0.856103 -0.599808 0.528458
C  -5.337406 0.421034 -1.343936
C  -5.203363 -0.024497 1.061756
C  1.212735 0.180237 -0.520817
C  6.911058 -1.205496 0.776671
C  6.807976 0.381246 -1.076203
C  0.442978 0.972197 -1.413676
C  0.54402 -0.611187 0.457841
C  4.73869 -0.404127 -0.034353
C  5.504332 -1.202549 0.855794
C  5.405137 0.393298 -1.009519
C  9.695197 0.797207 0.587644
C  -8.286791 0.019169 0.985506
C  -9.763676 0.109574 0.597999
H  9.52272 -1.328848 0.132728
H  9.441573 -0.271749 -1.29479
H  -3.462541 0.56051 -2.404498
H  -3.213814 -0.169434 1.8727
H  -1.531823 1.623872 -2.009165
H  -1.358544 -1.238635 1.263351
H  -5.93218 0.583441 -2.252546
H  -5.6996 -0.185086 2.020043
H  7.493185 -1.829142 1.465818
H  7.319833 0.992075 -1.830685
H  0.973818 1.582324 -2.151876
H  1.144912 -1.225639 1.134914
H  4.970612 -1.811163 1.59341
H  4.801911 0.99877 -1.692881
H  9.322948 1.769599 0.217679
H  10.798954 0.804894 0.528459
H  9.40607 0.709542 1.650409
H  -7.852261 0.395474 -0.996818
H  -10.008552 1.099548 0.170147
H  -10.371639 -0.044737 1.500645
H  -10.032071 -0.663091 -0.146369
