program: Gaussian 09
title: 000276261
version: EM64L-G09RevD.01
frameworkgroup: C1[X(C26H19N3)]
method: RPBEPBE
basis: SDD
operation: Freq
keyword: #pfreq=noraman
keyword: PBEPBE/SDD
title: #p freq=noraman PBEPBE/SDD
converged: YES YES NO NO
title: Mulliken charges:
elementType: N N N C C C C C C C C C C C C C C C C C C C C C C C C C C H H H H H H H H H H H H H H H H H H H
charge: -0.410155 -0.168141 -0.015293 -0.696454 0.343501 0.176641 -0.694530 0.272062 0.189177 0.323845 0.277895 0.181288 0.182252 -0.607266 -0.377938 -0.520632 -0.420781 -0.382033 -0.396235 -0.420258 0.514956 -0.394304 -0.455448 0.165260 -0.373246 -0.238256 -0.233038 -0.236292 -0.233523 0.246610 0.246580 0.246026 0.246059 0.276137 0.239647 0.270687 0.240724 0.240108 0.236916 0.241193 0.238852 0.224166 0.246248 0.225229 0.225174 0.225541 0.225923 0.305128
chargesum: 0.00000
title: Mulliken charges with hydrogens summed into heavy atoms:
elementType: N N N C C C C C C C C C C C C C C C C C C C C C C C C C C
charge: -0.105027 -0.168141 -0.015293 -0.203265 0.343501 0.176641 -0.202445 0.272062 0.189177 0.323845 0.277895 0.181288 0.182252 -0.331129 -0.138291 -0.249944 -0.180057 -0.141925 -0.159319 -0.179065 0.514956 -0.155453 -0.231281 0.165260 -0.126997 -0.013027 -0.007864 -0.010752 -0.007600
polarizability: 8.35544102e+02 3.80397839e+00 3.43164975e+02 3.82626584e-03 2.52421973e-01 1.19618482e+02
1716.lowfreq: -0.0014 -0.0006 0.0008 1.4937 3.2779 4.2561 19.6172 23.0696 25.6254
frequency: 19.5294 23.0692 25.4288 44.5507 84.4798 98.2978 125.8748 137.1947 145.9860 155.4605 199.1577 218.0417 222.7086 233.6958 238.4271 241.9474 264.0197 344.6372 370.0396 370.6835 378.6741 422.2656 428.8813 435.8012 436.4157 454.2649 483.2927 506.7215 510.9081 511.0430 539.0719 548.1018 555.7975 592.0890 603.6099 615.8126 630.1823 646.9345 650.2365 706.6564 710.5470 714.4509 719.0734 735.6073 741.9396 744.4458 751.1853 776.4950 781.3247 802.4426 821.8840 824.2458 831.7064 847.4412 868.4780 869.9075 890.6642 899.3115 930.4466 937.7017 941.8817 947.9468 967.9146 970.3651 972.1954 973.7456 985.0610 986.2550 993.9443 996.7546 1024.8563 1025.4936 1093.7822 1097.0909 1113.3833 1122.1043 1135.4879 1135.5668 1136.0120 1138.3495 1168.2738 1168.5695 1171.8616 1187.1137 1188.9459 1202.1763 1203.5745 1209.4997 1227.5251 1254.0354 1276.7758 1290.0108 1294.5042 1305.2149 1309.6491 1344.1653 1376.5563 1380.6254 1388.8633 1390.8672 1426.4925 1427.8702 1440.9696 1444.5731 1448.8618 1457.4236 1463.0633 1466.4456 1480.8100 1491.8285 1498.9938 1582.6932 1589.9370 1590.1624 1592.9548 1615.7478 1619.7645 1620.1130 1627.8358 2983.0839 2983.5016 3027.4392 3027.8006 3120.5525 3121.2437 3121.7500 3127.8559 3128.7657 3135.7625 3141.4600 3142.3226 3148.1085 3155.6311 3160.6232 3160.9609 3164.4571 3170.0648 3389.5350
redmass: 4.0237 6.3030 4.4274 5.7146 5.6845 6.0224 4.4643 3.8429 6.0562 4.6112 3.9807 6.3408 5.3472 6.3502 2.1338 2.1936 5.7047 4.6702 5.9064 4.7568 6.7828 2.7090 2.8451 2.8766 2.8704 6.3487 4.6366 3.2992 3.9294 3.4356 6.4765 6.0395 5.8849 3.0287 3.0807 6.8915 7.0884 6.4668 6.3064 2.4658 2.3901 1.5577 5.4890 5.5729 1.6347 1.6032 5.5730 2.0954 2.2830 4.2315 4.7269 1.5384 5.3746 1.4626 1.3758 1.3870 1.4693 1.5302 3.3470 1.5030 1.4727 1.3965 1.5272 1.8754 2.7901 1.6799 1.3371 1.3380 6.9543 5.7210 2.1215 2.1183 2.1088 2.1061 1.6975 1.9914 2.2655 1.2061 1.1476 1.5240 1.2041 1.1356 1.7430 1.8142 1.9314 2.0970 1.8323 2.0206 1.7192 2.4316 1.9201 1.6428 1.6109 1.8686 2.2365 7.6943 5.9776 7.2866 4.2228 3.7184 1.1871 1.1583 2.3082 2.5626 4.1750 2.6149 2.9044 4.3375 3.7259 2.6322 2.9728 7.5196 6.5964 6.8257 6.0865 7.4604 7.2884 7.2156 7.4401 1.0608 1.0609 1.0994 1.0993 1.0855 1.0854 1.0875 1.0894 1.0893 1.0888 1.0947 1.0946 1.0964 1.0916 1.1003 1.1003 1.0960 1.0922 1.0744
irintensity: 0.0535 0.0372 0.0251 0.0147 0.4783 3.4183 0.0422 0.6413 0.2850 0.0016 7.3959 3.9756 0.5626 2.2177 6.0505 9.9234 2.1849 0.0111 13.5063 2.3351 6.2422 15.6523 4.2766 0.2992 0.2058 5.2050 3.9878 0.6553 3.8938 0.0256 0.0515 0.4173 12.5906 2.9869 1.2526 36.0364 4.0300 1.2106 0.4522 10.8466 12.3382 42.2470 25.1814 0.9021 51.0360 81.3168 0.0137 58.7234 37.9043 0.2231 2.3982 40.5654 1.0784 30.4594 0.0013 0.0002 4.9171 9.0034 0.5000 2.3351 2.5744 0.6594 5.9214 17.2600 0.6161 10.8214 0.4854 0.4980 7.9443 0.3027 9.5857 4.1065 9.1513 11.8583 0.3989 108.4979 22.3933 2.3024 0.0029 16.4942 22.1397 3.5480 197.1380 0.6468 25.3201 20.2837 13.3749 45.2103 51.9637 79.6511 280.4170 41.6721 6.6117 1.6768 74.6299 265.5200 4.5893 28.9149 24.2352 5.3607 2.6487 17.1391 88.3612 19.3842 33.6269 22.8895 2.7843 60.6047 31.9000 9.4956 396.7958 0.1847 0.7809 10.6718 55.9176 0.8762 9.6409 9.1956 94.2808 8.4554 11.2485 7.3146 7.7379 10.9486 4.4493 13.3652 1.6601 3.7517 14.1074 25.8683 32.4407 26.8089 2.9493 73.3527 47.9127 14.8471 2.2683 16.0295
temp: 298.150 k
press: 1.00000 atm
elementType: 7 7 7 6 6 6 6 6 6 6 6 6 6 6 6 6 6 6 6 6 6 6 6 6 6 6 6 6 6 1 1 1 1 1 1 1 1 1 1 1 1 1 1 1 1 1 1 1
symmnumber: 1
zpe: 985805.1 jmol-1
zpe.correction: 0.375473 hartree
zpe.thermalcorrener: 0.397366 hartree
zpe.thermalcorrenthalpy: 0.398310 hartree
zpe.thermalcorrgfe: 0.322825 hartree
zpe.sumelectzpe: -1164.474858 hartree
zpe.sumelectthermal: -1164.452965 hartree
zpe.sumelectthermalent: -1164.452021 hartree
zpe.sumelectthermalfe: -1164.527506 hartree
dipole: -0.5978 0.8192 -0.0003
dipole: 1.0141
quadrupole: -147.3294 -142.9750 -177.9621
quadrupole: 4.6777 0.0200 0.0894
quadrupole: 8.7595 13.1138 -21.8733 4.6777 0.0200 0.0894
hfenergy: -1164.8503314 hartree
pointgroup: C01 [X(C26H19N3)]
dipole: 0.2291844 0.3042491 -0.1186947 debye
polarizability: 835.1531709|-0.7691894|315.7756584|-16.9648784|-73.2650248|147.3987302 unknown
InChI: InChI=1S/C26H19N3/c1-3-7-23-17(5-1)13-19-15-21(9-11-25(19)23)27-29-28-22-10-12-26-20(16-22)14-18-6-2-4-8-24(18)26/h1-12,15-16,27H,13-14H2
charge 0 multiplicity 1
48 atoms
N  1.137562 -2.119321 0.786435
N  -1.067943 -2.194627 0.868673
N  -0.029391 -1.446363 0.5629
C  4.209334 1.675041 -0.700434
C  3.805475 0.300808 -0.17699
C  4.975009 -0.478638 0.090146
C  -4.297581 1.605478 -0.468136
C  5.733272 1.604917 -0.707061
C  6.164723 0.325433 -0.236373
C  -3.826152 0.242932 0.030391
C  -5.816147 1.49362 -0.386177
C  -4.958699 -0.569271 0.364878
C  -6.184994 0.203254 0.107919
C  2.521011 -0.211696 0.042004
C  4.843836 -1.794966 0.585759
C  -2.522088 -0.239183 0.175276
C  6.671719 2.577454 -1.091781
C  -4.770541 -1.883064 0.850894
C  7.542314 0.021133 -0.151254
C  -6.801953 2.439439 -0.715759
C  2.397956 -1.539436 0.541761
C  -7.546851 -0.139064 0.272238
C  3.556832 -2.322397 0.810162
C  -2.331896 -1.567859 0.666888
C  -3.458451 -2.373883 0.99846
C  8.054149 2.271244 -1.006124
C  8.482908 1.003226 -0.539543
C  -8.167839 2.094932 -0.550715
C  -8.534679 0.81595 -0.06074
H  3.83537 2.489152 -0.048959
H  3.799053 1.866718 -1.711371
H  -3.953002 1.806956 -1.501494
H  -3.909424 2.430883 0.160462
H  1.619146 0.372323 -0.158059
H  5.725782 -2.409153 0.797498
H  -1.64832 0.36969 -0.076079
H  6.347051 3.560109 -1.453533
H  -5.625916 -2.516074 1.110638
H  7.882338 -0.956683 0.208553
H  -6.526109 3.430258 -1.095186
H  -7.837735 -1.125734 0.650209
H  3.442525 -3.343358 1.194911
H  -3.268074 -3.385382 1.371443
H  8.797568 3.019669 -1.302592
H  9.554929 0.78366 -0.480051
H  -8.947534 2.822188 -0.803616
H  -9.595098 0.567387 0.06004
H  1.062455 -3.082598 1.149186
