program: Gaussian 09
title: 000270680
version: EM64L-G09RevD.01
frameworkgroup: C1[X(C14H11BrN2O)]
method: RPBEPBE
basis: SDD
operation: Freq
keyword: #p
keyword: freq=noraman
keyword: PBEPBE/SDD
title: #p freq=noraman PBEPBE/SDD
converged: YES YES NO NO
title: Mulliken charges:
elementType: Br O N N C C C C C C C C C C C C C C H H H H H H H H H H H
charge: -0.006689 -0.290261 -0.482478 -0.661372 -0.692760 0.317911 0.189470 0.264849 0.209965 -0.567064 -0.387218 -0.367744 -0.392565 0.517654 -0.483777 -0.216940 -0.190901 0.264870 0.251848 0.251847 0.321517 0.238676 0.261567 0.242876 0.214034 0.247113 0.291599 0.348490 0.305483
chargesum: 0.00000
title: Mulliken charges with hydrogens summed into heavy atoms:
elementType: Br O N N C C C C C C C C C C C C C C
charge: -0.006689 -0.290261 -0.190878 -0.007399 -0.189065 0.317911 0.189470 0.264849 0.209965 -0.245546 -0.148541 -0.106178 -0.149690 0.517654 -0.269743 -0.216940 0.056212 0.264870
polarizability: 3.77958076e+02 4.42313721e+00 1.75556571e+02 -2.88053711e-04 3.14084518e-04 7.19457606e+01
1716.lowfreq: -3.6489 -0.0008 -0.0002 0.0010 3.7509 7.5385 32.2583 47.0624 66.4341
frequency: 32.2523 47.0570 66.4322 80.3215 127.0916 156.1472 162.1202 188.7953 232.4977 242.1617 272.8554 295.7830 328.3959 355.7253 376.2167 422.9202 439.2566 481.7880 494.3721 507.0768 520.8484 554.8738 578.9954 586.9566 598.0079 654.0725 664.2240 703.4491 712.2791 738.7754 757.4921 775.9277 815.8193 830.9941 841.4707 871.5559 920.3976 920.6582 941.0311 953.7475 974.4008 980.6441 999.3320 1043.1121 1055.6197 1109.8500 1134.2978 1136.8457 1156.8090 1180.0815 1202.5037 1226.1400 1269.7000 1275.0622 1306.8224 1314.2850 1369.6122 1377.9627 1413.3946 1425.7364 1447.4589 1455.3366 1492.8630 1513.9212 1576.3504 1589.3322 1609.1350 1614.0433 1632.4461 1660.2316 2988.2588 3033.2593 3108.5293 3137.3859 3144.9278 3155.8716 3169.0702 3181.1485 3528.9174 3543.4176 3698.1906
redmass: 5.7437 5.3168 5.4873 8.3999 4.2701 7.9664 4.3036 10.3512 2.1240 2.7355 6.6900 1.6036 5.6611 5.7606 4.5781 2.6984 3.0849 4.8358 1.1519 4.0705 3.0374 6.2224 4.3002 1.5636 1.9230 6.8201 6.6460 3.7145 7.7344 5.8198 3.1662 5.0447 1.4294 1.6497 5.2135 1.4228 1.4902 3.5653 1.3941 1.3740 1.8448 4.2471 4.6444 1.9099 2.0533 2.3315 1.1475 1.7297 1.4638 2.0756 1.6788 1.6241 1.5659 1.4754 3.8965 2.2111 4.4616 5.8129 3.2339 1.2428 3.2407 3.7920 4.0387 2.3272 7.8273 3.7575 4.7427 1.6326 6.9643 3.6076 1.0610 1.0993 1.0883 1.0895 1.0954 1.0929 1.0959 1.0933 1.0726 1.0492 1.1039
irintensity: 2.6664 16.6419 0.9579 2.0487 0.0402 4.9174 0.2315 2.6539 0.9315 11.5935 7.6606 25.9532 9.0158 2.2795 2.2913 24.5710 0.6869 0.3588 299.2984 1.4180 3.0997 1.4143 16.0250 44.9414 26.1345 0.8886 1.4759 22.7051 15.2208 6.1515 0.2601 9.1389 110.4650 1.9177 30.5028 12.5105 2.1472 2.2778 1.5366 0.8772 28.8143 13.4897 1.6305 38.2115 26.0976 24.1811 0.0661 17.9295 5.1760 14.5825 4.8870 13.2870 37.1134 102.0288 8.2610 206.6354 39.2317 121.7937 107.4538 44.1987 43.3623 202.3015 284.6639 491.3286 7.6016 143.5969 25.4950 4.9034 65.1316 255.7239 9.3146 5.6159 29.3798 5.3191 18.9229 3.3066 8.2866 7.3628 11.2047 79.3679 44.9179
temp: 298.150 k
press: 1.00000 atm
elementType: 35 8 7 7 6 6 6 6 6 6 6 6 6 6 6 6 6 6 1 1 1 1 1 1 1 1 1 1 1
symmnumber: 1
zpe: 571116.1 jmol-1
zpe.correction: 0.217527 hartree
zpe.thermalcorrener: 0.232919 hartree
zpe.thermalcorrenthalpy: 0.233863 hartree
zpe.thermalcorrgfe: 0.173359 hartree
zpe.sumelectzpe: -737.080221 hartree
zpe.sumelectthermal: -737.064829 hartree
zpe.sumelectthermalent: -737.063885 hartree
zpe.sumelectthermalfe: -737.124388 hartree
dipole: 5.7384 3.5464 0.0002
dipole: 6.7458
quadrupole: -81.4659 -104.6577 -120.0330
quadrupole: 17.1597 0.0021 -0.0008
quadrupole: 20.5863 -2.6056 -17.9808 17.1597 0.0021 -0.0008
hfenergy: -737.2977475 hartree
pointgroup: C01 [X(C14H11Br1N2O1)]
dipole: 2.1645493 -1.5357553 -0.0000769 debye
polarizability: 376.5823196|-17.2083319|176.9323281|0.0003074|0.0002952|71.9457606 unknown
InChI: InChI=1S/C14H11BrN2O/c15-10-1-3-12-8(6-10)5-9-7-11(17-14(16)18)2-4-13(9)12/h1-4,6-7,17H,5,16H2
charge 0 multiplicity 1
29 atoms
Br -6.282496 1.022474 -0.000118
O  4.373737 1.764158 0.000142
N  3.909421 -0.557007 0.000165
N  6.119729 0.228019 0.000048
C  -0.743247 1.598451 0.000007
C  0.306117 0.491857 0.000059
C  -0.334163 -0.784084 0.000076
C  -2.055536 0.822543 -0.000006
C  -1.792534 -0.582689 0.000035
C  1.702576 0.619839 0.00009
C  0.449635 -1.959031 0.000127
C  -3.372708 1.311915 -0.000051
C  -2.862147 -1.505216 0.000031
C  2.487635 -0.567877 0.000138
C  1.853078 -1.84503 0.000157
C  -4.425536 0.368318 -0.000054
C  -4.192983 -1.0249 -0.000014
C  4.763145 0.559215 0.000157
H  -0.650172 2.254358 0.887382
H  -0.650129 2.254318 -0.887393
H  2.202483 1.59031 0.000088
H  -0.014731 -2.951121 0.000143
H  -3.584894 2.385229 -0.000084
H  -2.680709 -2.585466 0.000063
H  2.469844 -2.753615 0.000194
H  -5.035593 -1.722213 -0.000018
H  4.345757 -1.481044 0.000218
H  6.773835 1.006473 0.000024
H  6.484184 -0.72219 -0.000107
