program: Gaussian 09
title: 000270675
version: EM64L-G09RevD.01
frameworkgroup: C1[X(C15H11BrO)]
method: RPBEPBE
basis: SDD
operation: Freq
keyword: #p
keyword: freq=noraman
keyword: PBEPBE/SDD
title: #p freq=noraman PBEPBE/SDD
converged: YES YES NO YES
title: Mulliken charges:
elementType: Br O C C C C C C C C C C C C C C C H H H H H H H H H H H
charge: 0.010482 -0.225048 -0.697970 0.291443 0.192101 0.271760 0.206722 -0.551637 -0.394610 -0.365591 -0.383130 0.334895 -0.376007 -0.218292 -0.189268 0.095699 -0.791842 0.252193 0.252191 0.255791 0.244189 0.263873 0.249467 0.280348 0.252224 0.238146 0.238193 0.263676
chargesum: 0.00000
title: Mulliken charges with hydrogens summed into heavy atoms:
elementType: Br O C C C C C C C C C C C C C C C
charge: 0.010482 -0.225048 -0.193586 0.291443 0.192101 0.271760 0.206722 -0.295846 -0.150421 -0.101717 -0.133663 0.334895 -0.095659 -0.218292 0.062956 0.095699 -0.051827
polarizability: 3.65865088e+02 -1.56765467e+00 1.69000094e+02 -1.32331632e-02 -6.49696509e-03 7.40062357e+01
1716.lowfreq: -2.2821 -0.0006 -0.0004 0.0008 2.9907 6.1330 36.2407 54.2575 93.1051
frequency: 36.2386 54.1953 93.1046 93.8467 148.2854 157.0004 184.3828 188.6655 200.9210 243.0202 295.0947 338.6670 339.1219 416.5623 418.1585 438.0650 482.9922 500.9808 538.3083 551.2710 553.8941 592.9300 624.2365 660.1283 688.3191 710.6739 744.9791 766.7994 829.5641 841.5132 862.2537 871.6838 882.0477 900.5785 945.8911 958.6479 968.0132 993.8781 997.8443 1027.7056 1056.6652 1069.4952 1110.9152 1132.5780 1136.4876 1171.1923 1180.8458 1203.5659 1238.6718 1273.3576 1295.5057 1302.0430 1364.6674 1371.8166 1377.6672 1413.7876 1425.4271 1438.0090 1446.6895 1451.6489 1462.9736 1485.7667 1563.3803 1575.9879 1599.6193 1608.8446 1623.3525 2984.1484 2986.6227 3031.4995 3068.8650 3125.5926 3135.3081 3140.7599 3142.2783 3157.9623 3161.3749 3173.9504
redmass: 8.8636 3.9027 7.5393 6.9609 1.0734 3.4314 6.1878 8.5042 5.0376 2.2826 5.3676 7.6196 5.5278 3.7090 2.7085 2.9370 3.3372 4.5594 5.6036 3.2744 5.9576 4.4184 2.6767 7.0718 5.7032 3.3969 5.7753 2.9614 1.4566 4.8616 1.5407 1.4058 4.5133 1.3737 2.0381 1.5079 1.8488 7.2197 1.3743 1.8186 2.1092 1.9988 2.1832 1.5562 1.1457 1.7924 2.0598 1.6254 1.7235 1.7448 1.7081 2.8962 1.4708 4.6679 3.6692 3.4606 1.2392 4.1354 1.1259 2.5281 1.0495 3.5034 7.0723 7.8134 8.0011 7.6608 7.1997 1.0374 1.0610 1.0994 1.0970 1.0992 1.0892 1.0912 1.0898 1.0930 1.0957 1.0959
irintensity: 0.8451 4.5343 1.3203 0.4375 0.3456 0.0115 1.6427 3.4978 0.1148 11.1172 0.5205 10.2104 0.6923 6.9971 11.6502 0.0841 0.8392 3.4029 0.2138 5.0264 0.5399 23.6595 0.5703 3.2676 2.0091 8.9301 5.1932 3.2891 63.1121 40.7279 32.2484 0.4109 0.0548 0.1202 46.4229 4.2993 15.6157 17.6528 0.6259 0.5665 39.6461 0.7569 13.4936 3.0722 0.0011 21.2823 29.9092 2.7795 63.9848 174.1118 108.0125 70.1517 32.2974 27.6662 27.8109 38.7960 21.8444 13.8772 40.1166 7.2553 20.5745 6.8784 201.3882 5.3265 125.0097 21.5004 32.3970 3.5905 9.2648 5.4067 13.1103 21.7202 6.5010 8.5821 6.0645 2.9748 5.0296 6.1947
temp: 298.150 k
press: 1.00000 atm
elementType: 35 8 6 6 6 6 6 6 6 6 6 6 6 6 6 6 6 1 1 1 1 1 1 1 1 1 1 1
symmnumber: 1
zpe: 554049.2 jmol-1
zpe.correction: 0.211026 hartree
zpe.thermalcorrener: 0.225382 hartree
zpe.thermalcorrenthalpy: 0.226326 hartree
zpe.thermalcorrgfe: 0.168347 hartree
zpe.sumelectzpe: -665.737055 hartree
zpe.sumelectthermal: -665.722700 hartree
zpe.sumelectthermalent: -665.721756 hartree
zpe.sumelectthermalfe: -665.779735 hartree
dipole: 1.2428 -2.2932 0.0007
dipole: 2.6084
quadrupole: -137.5586 -93.2987 -111.6142
quadrupole: 15.8378 -0.0034 -0.0007
quadrupole: -23.4014 20.8585 2.5429 15.8378 -0.0034 -0.0007
hfenergy: -665.9480814 hartree
pointgroup: C01 [X(C15H11Br1O1)]
dipole: -0.462766 0.9159397 0.0002642 debye
polarizability: 365.6113454|-7.2350702|169.253837|0.0134149|0.006113|74.0062357 unknown
InChI: InChI=1S/C15H11BrO/c1-9(17)10-2-4-14-11(6-10)7-12-8-13(16)3-5-15(12)14/h2-6,8H,7H2,1H3
charge 0 multiplicity 1
28 atoms
Br -6.038165 0.546176 -0.000328
O  5.129077 -0.872515 -0.000255
C  -0.603055 1.74855 0.00025
C  0.562715 0.765353 0.000282
C  0.070337 -0.576846 0.000141
C  -1.818975 0.829789 0.000073
C  -1.400878 -0.536444 0.000013
C  1.941223 1.020479 0.000409
C  0.970942 -1.668529 0.000145
C  -3.183366 1.167285 -0.000028
C  -2.357892 -1.575635 -0.000148
C  2.854582 -0.073133 0.000441
C  2.353432 -1.407881 0.000289
C  -4.12209 0.110412 -0.000187
C  -3.733104 -1.248788 -0.000248
C  4.344788 0.123179 0.000661
C  4.902532 1.544349 -0.000463
H  -0.588048 2.41046 0.88818
H  -0.587889 2.410592 -0.887578
H  2.311803 2.051361 0.000515
H  0.604396 -2.700863 0.000041
H  -3.517284 2.209115 0.000017
H  -2.054093 -2.627808 -0.000196
H  3.085937 -2.221792 0.000328
H  -4.491354 -2.036538 -0.000372
H  4.564114 2.10357 0.891796
H  4.562213 2.103102 -0.892286
H  6.001803 1.497601 -0.001592
