program: Gaussian 09
title: 000270672
version: EM64L-G09RevD.01
frameworkgroup: C1[X(C13H8ClNO)]
method: RPBEPBE
basis: SDD
operation: Freq
keyword: #p
keyword: freq=noraman
keyword: PBEPBE/SDD
title: #p freq=noraman PBEPBE/SDD
converged: NO YES NO NO
title: Mulliken charges:
elementType: Cl O N C C C C C C C C C C C C C H H H H H H H H
charge: -0.042410 -0.256249 -0.438529 0.331160 0.258486 0.119898 0.274645 -0.014629 -0.371231 -0.360779 -0.317256 -0.388073 -0.220698 -0.124946 -0.272652 -0.221134 0.333409 0.230182 0.221406 0.301273 0.232469 0.258119 0.233114 0.234423
chargesum: 0.00000
title: Mulliken charges with hydrogens summed into heavy atoms:
elementType: Cl O N C C C C C C C C C C C C C
charge: -0.042410 -0.256249 -0.105119 0.331160 0.258486 0.119898 0.274645 -0.014629 -0.141048 -0.139373 -0.015983 -0.155604 0.037421 -0.124946 -0.039538 0.013289
polarizability: 2.75442834e+02 1.01705394e+01 1.71852339e+02 1.14015280e-03 -7.69541072e-03 5.91996668e+01
1716.lowfreq: -5.2169 -2.2923 0.0020 0.0030 0.0032 5.4390 58.4131 85.9854 146.5875
frequency: 58.4096 85.9833 146.5875 152.0754 163.1673 251.3337 262.0539 323.6343 330.9833 339.6489 422.2397 430.3228 459.2111 488.9802 498.9879 511.2823 566.5062 596.2647 636.6354 658.6458 668.0046 715.6271 717.1988 744.1855 769.2966 786.6821 821.4213 832.1947 864.6071 880.3795 934.3173 943.2357 963.0336 982.6153 991.4033 1043.6239 1073.1121 1098.9497 1124.6351 1155.2454 1179.0010 1238.8555 1254.7189 1270.8913 1285.7791 1317.9283 1381.0821 1384.1948 1409.5902 1412.0968 1453.3180 1477.4274 1501.7192 1553.1244 1595.0888 1605.3954 1621.0477 1630.2674 3124.7247 3140.8768 3150.7849 3156.4379 3167.2615 3171.9249 3174.9021 3511.4111
redmass: 7.3612 4.5121 5.8059 10.2506 5.7834 9.1872 4.8763 4.6195 8.6768 6.7290 3.1668 7.6080 3.8415 8.2650 7.2742 3.1328 3.3925 5.8068 6.9137 2.4825 7.1576 6.0198 1.7364 2.8120 1.4093 2.8563 7.1695 1.6468 1.6584 4.7639 1.4392 1.3981 1.3617 1.3290 7.4977 2.0757 1.8509 5.4554 1.9416 1.3775 1.0764 1.5467 1.5726 2.0164 3.8000 2.0127 3.5495 6.3829 2.5553 5.3805 2.4345 3.2984 3.0335 7.4575 6.5347 7.1078 7.0691 5.1193 1.0882 1.0873 1.0903 1.0910 1.0927 1.0998 1.0972 1.0764
irintensity: 0.2850 2.0772 0.0026 0.3204 0.0797 0.0089 4.1947 0.4918 8.0946 0.5210 6.7699 3.9788 8.4940 31.8052 0.7175 0.4444 5.3687 9.8148 0.9068 20.2988 15.2652 2.5973 1.9268 6.2364 185.8346 0.0021 40.5671 28.6747 6.0120 0.3377 14.7030 0.8946 1.3797 0.1309 6.4472 2.3450 4.5695 15.3598 10.4054 2.9981 0.9081 17.4749 45.5222 2.6794 51.9368 28.2782 31.5548 58.4834 7.1656 0.1942 74.7483 35.6528 23.2270 23.4351 16.6860 83.8255 15.2006 343.0555 7.4818 2.7452 8.6892 12.8363 3.2740 15.7781 18.7101 37.2694
temp: 298.150 k
press: 1.00000 atm
elementType: 17 8 7 6 6 6 6 6 6 6 6 6 6 6 6 6 1 1 1 1 1 1 1 1
symmnumber: 1
zpe: 458544.0 jmol-1
zpe.correction: 0.174650 hartree
zpe.thermalcorrener: 0.186534 hartree
zpe.thermalcorrenthalpy: 0.187479 hartree
zpe.thermalcorrgfe: 0.136151 hartree
zpe.sumelectzpe: -1089.186016 hartree
zpe.sumelectthermal: -1089.174132 hartree
zpe.sumelectthermalent: -1089.173188 hartree
zpe.sumelectthermalfe: -1089.224515 hartree
dipole: -4.3790 -3.2625 0.0002
dipole: 5.4608
quadrupole: -90.4285 -96.7551 -103.4999
quadrupole: -6.8041 0.0007 -0.0004
quadrupole: 6.4660 0.1394 -6.6054 -6.8041 0.0007 -0.0004
hfenergy: -1089.3606662 hartree
pointgroup: C01 [X(C13H8Cl1N1O1)]
dipole: -1.7706178 -1.2168233 0.0000866 debye
dipolederiv: -1.0247751 0.0602804 -0.0000079 0.0181867 -0.1094863 0.0000032 -0.000004 0.0000041 -0.0615166 -0.7091206 -0.2976308 0.0000121 -0.4152207 -1.2466863 0.0000485 0.0000466 0.0000857 -0.3672216 -0.9638393 -0.6388554 0.0000465 -0.1076788 -0.538135 0.0000182 -0.0000013 0.0000113 -0.2942032 0.4431766 0.0422183 0.0000013 -0.128437 0.0078138 0.0000017 0.0000161 -0.0000032 0.0228315 -0.0667933 -0.0114192 -0.0000009 -0.1519798 -0.1769719 0.0000102 0.0000085 0.000015 -0.0022166 0.0302939 0.188403 -0.000014 0.0395054 -0.4137747 0.0000297 0.0000031 0.0000277 0.0044243 0.1952966 0.4277672 -0.0000296 0.3479756 0.5765403 -0.0000301 -0.0000254 -0.0000287 0.0951778 1.2886129 0.4660001 -0.0000221 0.2062146 1.4283717 -0.0000802 -0.0000296 -0.0001019 0.1903824 -0.2012807 0.0496748 -0.0000034 0.1265685 0.0811392 -0.0000128 -0.0000081 -0.0000132 -0.1420742 0.1437728 -0.0068989 0.000004 0.130306 0.1153113 -0.0000168 -0.0000049 -0.0000182 -0.1290234 -0.4288491 -0.0657694 0.0000027 0.249905 -0.0010672 -0.0000017 -0.000017 -0.0000057 -0.0610034 -0.033493 -0.2637681 0.00002 -0.0810644 -0.0116911 -0.0000132 0.0000079 -0.0000195 -0.1912743 -0.2193221 -0.0031208 -0.0000011 -0.0436787 0.089667 -0.0000115 0.0000022 -0.0000106 -0.0872044 1.4607525 -0.0486089 0.0000089 -0.1429859 -0.0175636 -0.0000053 0.0000129 -0.0000056 -0.0823493 -0.2952348 0.0575436 -0.0000045 0.2177954 0.0045784 -0.0000113 -0.0000163 -0.0000127 -0.1787566 0.0431153 0.0248632 0.000001 -0.2311411 0.076969 -0.0000174 0.0000187 -0.0000148 -0.1371464 0.1207811 0.001195 -0.0000032 -0.028534 0.1827426 0.000009 0.0000003 0.000011 0.3160573 0.0402713 -0.1032912 0.000006 -0.061267 -0.0331973 0.0000112 0.0000012 0.0000104 0.1457191 0.0737183 0.1070156 -0.0000086 0.065092 -0.049827 0.0000144 -0.0000058 0.0000149 0.1407363 0.1177103 -0.0092434 0. -0.0778846 0.0824056 0.0000046 0.0000059 0.0000054 0.1619191 0.0566527 0.0316024 -0.0000032 0.0959211 -0.0902921 0.0000194 -0.0000083 0.0000184 0.1690818 0.0505727 0.0685032 -0.0000048 0.0707077 -0.0003403 0.0000106 -0.0000042 0.00001 0.1607032 0.0050182 -0.0850551 0.0000044 -0.1114593 -0.0509542 0.0000144 0.0000062 0.0000148 0.1678443 -0.127037 0.0085945 -0.0000036 0.0131534 0.0944481 0.0000048 -0.0000048 0.0000054 0.1591128 unknown
polarizability: 276.0680818|6.1870156|171.227091|0.0008454|-0.0077333|59.1996668 unknown
InChI: InChI=1S/C13H8ClNO/c14-8-5-6-9-10-3-1-2-4-12(10)15-13(16)11(9)7-8/h1-7,15H
charge 0 multiplicity 1
24 atoms
Cl 4.966238 -0.563925 0.000049
O  0.932041 3.076866 -0.000235
N  -1.056064 1.876438 -0.000142
C  0.305827 -0.597006 0.000039
C  -1.165814 -0.568851 0.000029
C  1.035869 0.635293 -0.000039
C  -1.824233 0.70211 -0.000068
C  0.343679 1.951721 -0.000119
C  1.05801 -1.808343 0.00012
C  -1.980839 -1.734909 0.000102
C  2.45359 0.652272 -0.000038
C  -3.241109 0.789333 -0.000092
C  2.461952 -1.79994 0.000123
C  3.146719 -0.561167 0.000043
C  -3.383831 -1.652027 0.000081
C  -4.017011 -0.381743 -0.000016
H  -1.534925 2.782716 -0.000215
H  0.547823 -2.77574 0.000178
H  -1.511765 -2.723659 0.000178
H  2.961474 1.621459 -0.0001
H  -3.723242 1.774445 -0.000168
H  3.024677 -2.738177 0.000184
H  -3.986899 -2.565494 0.000139
H  -5.109766 -0.311073 -0.000033
