program: Gaussian 09
title: 000276274
version: EM64L-G09RevD.01
frameworkgroup: C1[X(C17H10Cl4N2O3)]
method: RPBEPBE
basis: SDD
operation: Freq
keyword: #p
keyword: freq=noraman
keyword: PBEPBE/SDD
title: #p freq=noraman PBEPBE/SDD
converged: YES YES NO NO
title: Mulliken charges:
elementType: Cl Cl Cl Cl O O O N N C C C C C C C C C C C C C C C C C H H H H H H H H H H
charge: 0.052724 0.021096 0.058486 -0.041949 -0.274683 -0.213079 -0.170310 0.102239 -0.483444 0.424608 0.350014 0.280028 0.235837 -0.298627 -0.728868 -0.392847 0.882264 -0.381004 -0.331190 -0.408633 -0.235755 -0.118533 0.222637 -0.768283 0.289702 -0.752802 0.283597 0.312247 0.262705 0.314452 0.218648 0.262697 0.258351 0.256935 0.256452 0.254289
chargesum: 0.00000
title: Mulliken charges with hydrogens summed into heavy atoms:
elementType: Cl Cl Cl Cl O O O N N C C C C C C C C C C C C C C C C C
charge: 0.052724 0.021096 0.058486 -0.041949 -0.274683 -0.213079 -0.170310 0.102239 -0.168993 0.424608 0.350014 0.280028 0.235837 -0.298627 -0.728868 -0.392847 0.882264 -0.097407 -0.018944 -0.408633 0.026950 -0.118533 0.222637 -0.028586 0.289702 0.014874
polarizability: 4.33209113e+02 -6.49522873e+00 3.28634074e+02 5.56570446e+00 -4.87642294e+00 1.11797942e+02
1716.lowfreq: -5.3883 -3.1480 0.0022 0.0027 0.0028 4.4878 22.7359 31.3539 34.8035
frequency: 22.7188 31.3471 34.8006 54.5000 57.5607 61.5103 64.0839 72.2672 73.1270 78.7137 85.2144 110.0865 136.4099 148.8762 173.2876 188.3036 192.4640 203.2490 219.9719 235.3182 260.0424 263.4709 285.3190 293.0682 317.5226 322.4263 360.1754 381.1272 396.8415 400.5886 435.1981 438.2273 485.8016 487.2405 534.2864 544.1645 548.2376 572.3832 578.8692 598.6966 607.7086 637.9114 641.4201 671.7390 694.2540 704.9412 718.6488 773.4967 774.9490 788.9934 809.9788 833.7488 835.9427 864.9776 906.4968 911.9244 937.1752 966.2905 966.3222 988.4646 1036.6993 1039.7523 1045.7611 1072.5520 1089.0773 1108.6096 1139.1738 1168.0082 1211.6009 1219.4515 1247.2055 1279.7226 1336.6012 1354.6360 1382.7547 1384.7423 1400.4265 1414.9433 1425.4801 1440.3277 1449.1993 1453.3085 1455.3043 1466.1647 1472.4467 1543.5491 1554.8703 1579.5370 1593.6578 1602.0370 1648.6147 1722.3495 2995.0535 3007.7984 3084.3424 3096.6789 3124.1860 3143.6602 3168.4302 3197.7217 3218.1663 3520.3046
redmass: 11.0136 9.1798 3.6829 6.2460 7.0585 1.2388 1.1916 8.3295 4.0198 4.2805 5.2087 14.5756 11.6929 6.2673 9.0315 19.1840 8.7946 10.4110 16.8313 7.9078 8.5170 9.7292 8.0437 6.0871 19.3180 6.8625 10.0775 5.5272 6.0038 4.9537 5.6050 6.1745 4.8027 4.7799 3.6237 1.5681 3.1372 3.3405 7.3776 8.3053 6.7676 6.5214 6.4604 7.9693 7.9663 9.8571 8.5068 4.9058 6.9206 7.7804 10.3505 6.6021 1.4965 10.7022 5.0617 1.4806 6.7872 1.3810 2.5241 1.9372 1.6804 1.6458 6.1076 2.1923 5.5845 3.0319 2.5419 1.9132 6.6204 2.7465 1.9554 2.4154 7.4221 7.6411 1.2253 1.2396 3.8823 3.8630 5.0033 2.0202 1.5466 1.0583 1.0464 1.3230 1.6063 8.3294 10.2597 8.1684 11.4918 7.9708 6.8332 10.9536 1.0374 1.0367 1.0986 1.0976 1.0989 1.1007 1.0910 1.0948 1.0933 1.0762
irintensity: 0.8307 0.3307 4.1786 3.1848 3.7560 0.5559 0.2322 0.2646 2.6046 5.5008 0.7590 0.0311 3.0453 1.0698 0.7951 0.4467 0.9201 0.2185 0.1500 1.6696 1.3986 0.8361 2.5473 2.0802 1.0496 1.0562 1.5310 0.8727 21.8756 5.1208 5.7399 12.6611 2.9497 15.1354 14.0481 71.0347 1.9704 8.8547 8.6942 0.9140 2.8172 10.1455 22.6478 7.5537 7.3467 17.2795 171.0691 9.2578 39.0425 56.5402 132.2804 140.8905 42.0966 188.4577 78.9319 16.9936 8.1836 1.0229 126.1963 34.8192 26.3777 9.5648 14.1240 13.3845 19.0014 54.9058 403.3464 63.4971 67.7740 185.7844 2.4975 11.1141 181.2413 10.6763 54.1999 59.0586 74.0522 17.9508 11.4530 381.9773 77.6788 27.8258 21.6131 70.6103 107.3479 7.9200 0.5313 18.4951 13.7919 3.4083 133.8573 271.0645 8.3189 0.7799 12.1643 5.6166 8.3557 11.9277 1.2918 1.4038 2.5904 26.1740
temp: 298.150 k
press: 1.00000 atm
elementType: 17 17 17 17 8 8 8 7 7 6 6 6 6 6 6 6 6 6 6 6 6 6 6 6 6 6 1 1 1 1 1 1 1 1 1 1
symmnumber: 1
zpe: 608168.2 jmol-1
zpe.correction: 0.231639 hartree
zpe.thermalcorrener: 0.256949 hartree
zpe.thermalcorrenthalpy: 0.257893 hartree
zpe.thermalcorrgfe: 0.173144 hartree
zpe.sumelectzpe: -2827.379549 hartree
zpe.sumelectthermal: -2827.354239 hartree
zpe.sumelectthermalent: -2827.353295 hartree
zpe.sumelectthermalfe: -2827.438045 hartree
dipole: 1.5686 0.5574 -2.2748
dipole: 2.8188
quadrupole: -156.5047 -175.3123 -181.4121
quadrupole: -8.0499 12.5165 0.3887
quadrupole: 14.5716 -4.2359 -10.3357 -8.0499 12.5165 0.3887
hfenergy: -2827.6111881 hartree
pointgroup: C01 [X(C17H10Cl4N2O3)]
dipole: -0.6393922 0.196458 0.8845919 debye
polarizability: 432.7908852|3.319462|327.6112657|15.7595369|13.8606942|113.2389783 unknown
InChI: InChI=1S/C17H10Cl4N2O3/c1-6(24)22-17-14(20)12-11(13(19)15(17)21)9-4-3-8(18)5-10(9)16(12)23-26-7(2)25/h3-5,22H,1-2H3
charge 0 multiplicity 1
36 atoms
Cl 1.531968 2.634162 0.420565
Cl 1.562197 -3.806039 0.137805
Cl 4.25897 -2.177194 0.651774
Cl -5.67727 -2.261858 -0.517279
O  -2.856493 2.091514 0.10035
O  4.994205 0.018751 -1.420764
O  -2.409859 4.406043 0.393107
N  -1.407816 1.882198 0.209175
N  3.948279 0.875094 0.493154
C  0.292732 -1.31029 0.116763
C  0.284896 0.124499 0.210374
C  -1.103875 -1.772744 -0.045774
C  -1.963857 -0.624184 -0.042646
C  -1.127871 0.590735 0.124666
C  1.490699 0.827572 0.332357
C  1.51585 -1.996816 0.20118
C  2.740819 0.141061 0.385022
C  -1.656124 -3.061592 -0.193161
C  -3.359395 -0.754278 -0.185029
C  2.728746 -1.281046 0.368672
C  -3.057798 -3.203598 -0.33765
C  -3.877571 -2.057808 -0.330765
C  5.017518 0.789627 -0.427621
C  6.199869 1.687508 -0.085299
C  -3.218343 3.493482 0.209156
C  -4.720698 3.580115 0.054057
H  -1.024061 -3.95056 -0.200246
H  -4.010664 0.118537 -0.183771
H  -3.503215 -4.195565 -0.454364
H  3.935232 1.684188 1.119849
H  5.920409 2.566937 0.521183
H  6.674329 2.02471 -1.01957
H  6.946939 1.101894 0.481278
H  -5.037019 4.626675 0.168984
H  -5.024159 3.210919 -0.941229
H  -5.224476 2.953653 0.810093
