program: Gaussian 09
title: 000270671
version: EM64L-G09RevD.01
frameworkgroup: C1[X(C13H8ClNO)]
method: RPBEPBE
basis: SDD
operation: Freq
keyword: #p
keyword: freq=noraman
keyword: PBEPBE/SDD
title: #p freq=noraman PBEPBE/SDD
converged: NO YES NO NO
title: Mulliken charges:
elementType: Cl O N C C C C C C C C C C C C C H H H H H H H H
charge: -0.056222 -0.257400 -0.438081 0.280170 0.310364 0.279669 0.116164 -0.016429 -0.303873 -0.367782 -0.381227 -0.346602 -0.170841 -0.236661 -0.229390 -0.236891 0.332753 0.247351 0.225752 0.237935 0.279763 0.259931 0.233488 0.238059
chargesum: 0.00000
title: Mulliken charges with hydrogens summed into heavy atoms:
elementType: Cl O N C C C C C C C C C C C C C
charge: -0.056222 -0.257400 -0.105328 0.280170 0.310364 0.279669 0.116164 -0.016429 -0.056522 -0.142030 -0.143292 -0.066839 -0.170841 -0.003173 0.030541 0.001168
polarizability: 2.59456523e+02 -6.93953298e+00 1.82489263e+02 1.33632689e-02 3.33029215e-03 5.90847645e+01
1716.lowfreq: -9.2942 -0.0025 -0.0020 -0.0017 1.9623 2.3924 58.5049 93.1519 142.3474
frequency: 58.5020 93.1506 142.3471 145.8372 167.8250 242.9872 283.3301 301.9740 345.5070 347.1694 419.0264 421.5266 439.4780 472.2398 503.7015 525.0156 584.0011 603.3885 626.7211 646.0764 680.4400 720.4620 722.5864 736.1439 784.5627 794.4355 804.3295 818.2815 875.8280 882.9339 894.9532 942.2752 980.1983 1006.2725 1008.4505 1039.5027 1079.9502 1092.5338 1125.8537 1149.6310 1178.6991 1234.7319 1259.9179 1274.0235 1287.7607 1316.3506 1368.9821 1391.3202 1402.0423 1434.6268 1444.6519 1482.2291 1492.2533 1559.3443 1590.9108 1608.2828 1620.4789 1632.1449 3134.1706 3135.4279 3148.0713 3159.4925 3171.1144 3174.9029 3176.8788 3513.4777
redmass: 8.0760 4.3776 4.8438 9.6079 7.4401 4.4319 6.5580 15.0683 5.3722 8.0164 6.1503 3.1522 3.6414 7.0228 3.0874 8.7739 3.9224 6.7010 6.4378 2.0520 7.1704 6.2117 2.9387 1.6033 1.7908 2.4429 6.0411 1.5889 5.1548 1.6536 1.4666 1.3525 1.3810 6.3358 1.3447 2.2526 2.8615 2.3104 2.1357 1.3713 1.0885 1.6079 1.7230 1.7250 3.2653 2.1969 2.9526 8.3248 5.0817 3.0895 2.2242 3.1449 3.2855 6.5645 6.6927 6.9382 6.7317 5.3458 1.0858 1.0900 1.0894 1.0949 1.0996 1.0937 1.0941 1.0765
irintensity: 3.0469 2.3078 0.0842 0.5657 1.5647 0.5093 4.3518 2.2587 0.1229 6.0917 1.1737 5.3646 2.2294 5.5643 6.8614 17.8605 11.6952 9.2133 7.1753 1.5336 4.5158 3.2914 0.7204 106.7811 36.6237 6.8918 12.1189 91.2352 18.7039 11.2727 0.3672 1.2743 2.2764 14.1899 0.5501 15.2242 10.5919 28.4333 9.4082 13.7612 0.5092 8.9199 18.1694 4.8360 18.2052 87.5932 16.8553 48.2092 6.7021 12.8788 33.0578 55.9010 31.1795 3.8722 16.5455 116.9378 22.4453 351.2096 2.7967 8.5868 9.2427 8.4743 18.8552 9.2781 1.0183 38.0524
temp: 298.150 k
press: 1.00000 atm
elementType: 17 8 7 6 6 6 6 6 6 6 6 6 6 6 6 6 1 1 1 1 1 1 1 1
symmnumber: 1
zpe: 458778.1 jmol-1
zpe.correction: 0.174739 hartree
zpe.thermalcorrener: 0.186620 hartree
zpe.thermalcorrenthalpy: 0.187565 hartree
zpe.thermalcorrgfe: 0.136239 hartree
zpe.sumelectzpe: -1089.185719 hartree
zpe.sumelectthermal: -1089.173838 hartree
zpe.sumelectthermalent: -1089.172894 hartree
zpe.sumelectthermalfe: -1089.224219 hartree
dipole: -1.1190 -1.0267 -0.0005
dipole: 1.5187
quadrupole: -107.1205 -86.8898 -103.4858
quadrupole: -18.8362 -0.0027 -0.0022
quadrupole: -7.9551 12.2756 -4.3204 -18.8362 -0.0027 -0.0022
hfenergy: -1089.3604582 hartree
pointgroup: C01 [X(C13H8Cl1N1O1)]
dipole: -0.3762605 -0.4641306 -0.0002072 debye
dipolederiv: -0.6576949 -0.3034871 -0.0000337 -0.4660172 -0.3806937 -0.0000322 -0.0000318 -0.0000211 -0.0651879 -0.9891979 -0.4093551 0.0000863 -0.5640719 -1.0352498 0.0000585 -0.0005045 -0.000377 -0.3687326 -1.2114616 -0.5162244 -0.000181 0.0135881 -0.3835827 0.0000067 0.0000236 -0.0000024 -0.2943983 -0.0347945 -0.0298687 0.0000126 -0.1600483 -0.0665606 -0.0000005 -0.0000194 -0.0000498 0.0012908 0.3443259 -0.0334328 -0.0000182 -0.2705974 0.1099858 -0.0000322 -0.0000643 0.0000902 0.0225613 0.4142182 0.5151106 0.0000501 0.511812 0.3384764 0.0000101 0.0000573 -0.0000124 0.090226 -0.0432565 0.0518875 0.0000052 -0.0962797 -0.4649787 -0.0000377 -0.000052 0.0000365 0.0070735 1.5951239 0.4752432 0.0000366 0.236169 1.2358299 -0.0000016 0.00053 0.0002631 0.1891245 -0.089216 -0.1089554 -0.0000143 -0.0365249 -0.0592515 0.0000009 -0.0000071 -0.0000056 -0.0908674 -0.1968118 0.1551291 0.0000031 0.262598 -0.0555209 0.0000136 -0.0000063 0.0000146 -0.1456492 0.0063894 -0.2185926 -0.0000154 -0.0453408 0.0714245 0.0000181 0.0000209 0.0000802 -0.1824987 -0.046505 -0.0443917 0.0000056 0.2378654 0.0338698 -0.000004 -0.0000024 0.0000151 -0.1035101 0.7009071 0.5293498 0.0000449 0.8911916 0.4356556 0.0000611 0.0000567 0.0000441 -0.08768 0.0973796 -0.0204963 0.0000262 -0.0404427 0.1804443 -0.0000106 0.000028 -0.000011 -0.131384 -0.2543803 -0.0436575 -0.0000168 -0.3391766 -0.0158276 0.0000029 -0.0000234 0.0000087 -0.0949159 0.05574 -0.0383693 0.0000437 -0.161039 -0.1407612 -0.0000084 0.000047 0.0000006 -0.1618986 0.1177176 0.0173178 0.0000195 -0.0000474 0.1900109 -0.0000159 -0.0000082 -0.0000387 0.3165375 0.1262554 0.0455301 0.0000057 0.0160227 -0.0281881 -0.0000107 0.0000063 -0.0000034 0.1486475 0.0011736 -0.1196609 -0.0000149 -0.0816688 0.0108248 -0.0000054 0.0000232 -0.0000173 0.1459453 0.068328 -0.025992 -0.0000042 0.0263019 -0.1019163 -0.0000207 0.0000028 -0.0000148 0.1688892 0.0596013 -0.0283184 -0.0000023 -0.1013222 0.0641063 -0.0000018 -0.0000206 0.0000098 0.1549664 -0.0293185 0.044498 0.0000021 0.0340954 0.0950224 -0.0000068 0.0000054 -0.0000213 0.1652713 0.0705169 0.0445457 -0.0000088 0.0747916 -0.1044209 0.0000111 -0.0000191 0.0000162 0.1552863 -0.1050399 0.0621903 -0.0000319 0.0581413 0.0713012 0.0000057 -0.0000422 -0.0000044 0.1609031 unknown
polarizability: 259.8147783|4.5227046|182.1310074|0.0127305|0.0052538|59.0847645 unknown
InChI: InChI=1S/C13H8ClNO/c14-8-5-6-12-11(7-8)9-3-1-2-4-10(9)13(16)15-12/h1-7,15H
charge 0 multiplicity 1
24 atoms
Cl -4.471639 -1.827663 -0.000366
O  2.344007 2.69658 0.000412
N  0.103699 2.092242 -0.000098
C  -0.673126 -0.2277 -0.000262
C  0.733895 -0.665241 -0.000191
C  -0.95632 1.17573 -0.000143
C  1.774395 0.319516 -0.00011
C  1.471376 1.774149 -0.000323
C  -1.7721 -1.129697 -0.000317
C  1.116731 -2.037702 -0.000127
C  -2.296114 1.645864 -0.000079
C  3.139236 -0.066221 0.000093
C  -3.085098 -0.644192 -0.000287
C  2.471346 -2.411545 0.000051
C  -3.36937 0.740131 -0.000171
C  3.492949 -1.424892 0.000168
H  -0.103963 3.095855 0.000075
H  -1.604258 -2.209334 -0.000369
H  0.354372 -2.822633 -0.000189
H  -2.496081 2.723529 0.00002
H  3.892202 0.728646 0.00014
H  -4.403297 1.095941 -0.000139
H  2.739091 -3.473878 0.000113
H  4.546367 -1.723384 0.000301
