program: Gaussian 09
title: 000270666
version: EM64L-G09RevD.01
frameworkgroup: C1[X(C16H12N2O4)]
method: RPBEPBE
basis: SDD
operation: Freq
keyword: #p
keyword: freq=noraman
keyword: PBEPBE/SDD
title: #p freq=noraman PBEPBE/SDD
converged: YES YES NO NO
title: Mulliken charges:
elementType: O O O O N N C C C C C C C C C C C C C C C C H H H H H H H H H H H H
charge: -0.147258 -0.245502 -0.231332 -0.188642 -0.346931 0.118331 0.289677 0.218774 0.283564 0.226543 -0.307754 -0.516894 -0.398125 0.502382 -0.393098 -0.368592 -0.413113 -0.216552 -0.229855 0.284287 -0.223325 -0.666661 0.300921 0.251904 0.248358 0.259739 0.281357 0.233509 0.238293 0.235029 0.235251 0.214048 0.234903 0.236764
chargesum: 0.00000
title: Mulliken charges with hydrogens summed into heavy atoms:
elementType: O O O O N N C C C C C C C C C C C C C C C C
charge: -0.147258 -0.245502 -0.231332 -0.188642 -0.346931 0.118331 0.289677 0.218774 0.283564 0.226543 -0.307754 -0.215973 -0.146221 0.502382 -0.144740 -0.108853 -0.131756 0.016957 0.008438 0.284287 0.246955 0.019054
polarizability: 3.59504169e+02 1.12766144e+01 2.02343472e+02 1.52367285e+01 -1.21385513e+01 1.12836692e+02
1716.lowfreq: -6.5867 -3.4153 -0.0002 0.0005 0.0010 1.9860 11.4164 29.7838 35.4793
frequency: 9.7371 29.7602 35.4743 59.0198 77.6387 93.4508 126.3196 127.5068 146.0274 152.7911 170.7142 202.8868 214.9872 244.5942 255.3294 271.4854 294.4759 343.7163 363.3901 402.0648 414.0675 422.6599 437.1127 443.0325 488.0990 519.9517 547.8706 581.0630 583.9916 639.6085 677.1564 685.1894 704.1415 721.9608 751.9371 756.8516 780.4347 787.0500 800.2017 820.1246 832.4789 839.8439 884.7157 901.8509 930.6465 957.7172 964.3831 971.5883 996.2101 1000.0353 1007.9064 1027.0399 1036.8401 1075.5676 1101.7449 1114.0976 1135.1976 1142.1324 1166.3705 1176.5254 1196.7578 1226.7395 1251.0992 1275.9405 1293.1070 1295.9450 1361.7693 1367.6716 1389.8955 1403.2239 1409.2639 1443.1519 1448.9430 1457.8255 1461.9267 1472.7574 1481.1465 1485.9617 1594.8626 1600.0092 1602.3479 1618.7708 1621.7645 1640.5622 3000.2873 3015.3874 3077.2278 3097.2897 3114.2040 3131.6448 3143.0921 3146.0724 3154.1267 3169.2719 3170.2676 3176.1931
redmass: 3.3383 5.6645 6.0292 4.1331 5.5817 4.1610 4.6801 3.8984 4.6184 6.7886 6.3360 6.6774 7.5779 1.4003 4.8331 8.3449 6.1843 4.8379 4.4911 3.2689 10.1594 6.6960 3.2102 6.2215 5.2851 5.7625 7.3196 7.7194 3.7105 6.9793 6.2492 5.9305 9.7560 5.8469 2.2700 2.5001 4.6553 3.4507 1.1009 4.5447 3.0218 1.6999 4.3582 1.5096 1.8414 2.6219 1.8420 1.4711 5.6454 1.3635 2.6101 2.2773 3.2028 2.8661 2.0759 2.2615 1.4547 1.7737 1.6637 1.5022 2.7205 2.1689 1.1346 1.8181 1.8094 2.7084 1.6233 6.5313 3.3330 1.2742 9.5546 2.8602 2.7347 3.4599 1.0394 1.0643 4.3956 1.0700 7.8195 7.4225 7.5603 9.6828 8.7482 10.6668 1.0360 1.0580 1.1072 1.0985 1.1030 1.0864 1.0900 1.0901 1.0948 1.1001 1.0937 1.0960
irintensity: 0.8333 2.2613 0.9865 0.8504 0.3494 0.1940 0.8440 3.5896 0.5287 0.3409 2.3973 3.0819 0.7076 1.1420 6.1107 9.3915 20.7866 2.1269 14.1370 4.1526 19.4584 15.0761 1.1841 5.6251 7.2114 1.8083 7.0678 14.2621 12.8545 7.6930 26.9454 21.7452 11.6899 0.7668 40.2108 34.7438 116.1781 9.0235 3.8504 16.6661 12.2988 13.9133 127.7945 2.5631 9.5373 32.4950 19.6936 6.7201 3.6071 0.1473 8.4383 33.1910 204.0402 18.5226 157.7356 2.4561 6.2601 83.8044 137.0933 100.8230 29.2371 40.9063 0.0742 57.5681 61.5960 334.0092 27.7456 7.8281 14.2352 25.2900 209.8866 11.7655 36.6227 36.6278 12.8317 6.2358 7.6209 17.6584 42.9045 61.0429 31.6453 191.9514 39.8156 90.9116 18.9106 16.7845 5.9711 24.9690 37.2425 2.2299 4.1533 5.9468 14.0720 35.0942 0.2262 5.2824
temp: 298.150 k
press: 1.00000 atm
elementType: 8 8 8 8 7 7 6 6 6 6 6 6 6 6 6 6 6 6 6 6 6 6 1 1 1 1 1 1 1 1 1 1 1 1
symmnumber: 1
zpe: 647438.6 jmol-1
zpe.correction: 0.246596 hartree
zpe.thermalcorrener: 0.265809 hartree
zpe.thermalcorrenthalpy: 0.266753 hartree
zpe.thermalcorrgfe: 0.196294 hartree
zpe.sumelectzpe: -1025.711317 hartree
zpe.sumelectthermal: -1025.692105 hartree
zpe.sumelectthermalent: -1025.691161 hartree
zpe.sumelectthermalfe: -1025.761619 hartree
dipole: -0.6312 1.7830 -2.3584
dipole: 3.0232
quadrupole: -84.6777 -130.4667 -131.0294
quadrupole: -16.1646 -1.2643 -7.6730
quadrupole: 30.7136 -15.0754 -15.6381 -16.1646 -1.2643 -7.6730
hfenergy: -1025.9579138 hartree
pointgroup: C01 [X(C16H12N2O4)]
dipole: 0.2387743 0.682728 0.9442333 debye
polarizability: 359.8760376|-9.0961363|201.3732221|14.3880345|14.5363811|113.4350736 unknown
InChI: InChI=1S/C16H12N2O4/c1-2-22-16(20)18(17-21)10-7-8-12-11-5-3-4-6-13(11)15(19)14(12)9-10/h3-9H,2H2,1H3
charge 0 multiplicity 1
34 atoms
O  1.897761 -2.622164 -1.148694
O  -4.68961 -0.320326 0.018531
O  -2.855748 -1.429207 0.954663
O  -2.556614 2.503893 -1.487474
N  -2.563533 0.585715 -0.232838
N  -3.293193 1.594543 -1.021982
C  1.67074 0.717815 0.200253
C  1.030319 -0.445884 -0.324717
C  3.137884 0.477876 0.22196
C  3.389425 -0.831374 -0.28987
C  2.080241 -1.47446 -0.660136
C  -0.357341 -0.524995 -0.47432
C  0.899135 1.824961 0.591004
C  -1.130152 0.595594 -0.067788
C  4.206856 1.289967 0.638459
C  -0.509722 1.757668 0.454847
C  4.691103 -1.344468 -0.391578
C  5.527066 0.774452 0.537634
C  5.770358 -0.525364 0.030051
C  -3.351878 -0.482375 0.302872
C  -5.585604 -1.401672 0.554936
C  -7.005603 -1.006596 0.170087
H  -0.826578 -1.427235 -0.876265
H  1.361764 2.729716 0.998095
H  4.039192 2.298036 1.032812
H  -1.127951 2.603525 0.767474
H  4.858289 -2.351593 -0.787281
H  6.372673 1.393261 0.85784
H  6.798387 -0.896816 -0.036147
H  -5.270766 -2.360482 0.105887
H  -5.437154 -1.460833 1.64784
H  -7.714466 -1.770747 0.537478
H  -7.278752 -0.034935 0.614667
H  -7.111426 -0.930694 -0.925099
