program: Gaussian 09
title: 000276199
version: EM64L-G09RevD.01
frameworkgroup: C1[X(C23H16O)]
method: RPBEPBE
basis: SDD
operation: Freq
keyword: #pfreq=noraman
keyword: PBEPBE/SDD
title: #p freq=noraman PBEPBE/SDD
converged: YES YES NO NO
title: Mulliken charges:
elementType: O C C C C C C C C C C C C C C C C C C C C C C C H H H H H H H H H H H H H H H H
charge: -0.434856 -0.242858 0.255152 0.315296 0.338879 0.153323 0.139183 0.114071 -0.421814 -0.385510 -0.403600 -0.408069 -0.375207 0.407257 -0.247933 -0.262221 -0.232277 -0.232251 -0.381304 -0.261376 -0.478157 -0.443565 -0.284979 -0.244955 0.257832 0.269829 0.241807 0.241239 0.254593 0.349740 0.229257 0.227163 0.227759 0.227015 0.328419 0.228329 0.239791 0.237780 0.228802 0.228418
chargesum: 0.00000
title: Mulliken charges with hydrogens summed into heavy atoms:
elementType: O C C C C C C C C C C C C C C C C C C C C C C C
charge: -0.085116 -0.242858 0.255152 0.315296 0.338879 0.153323 0.139183 0.114071 -0.163982 -0.115681 -0.161794 -0.166830 -0.120614 0.407257 -0.018677 -0.035058 -0.004518 -0.005236 -0.052885 -0.033047 -0.238366 -0.205785 -0.056177 -0.016538
polarizability: 3.26701563e+02 -2.79357469e+01 2.69074949e+02 -1.93003896e+01 8.60316434e+00 1.66525217e+02
1716.lowfreq: -5.6152 -0.0004 -0.0003 0.0003 3.8485 6.0991 39.7022 44.5137 54.2794
frequency: 39.6754 44.5117 54.2649 99.4760 121.1609 147.2516 161.5625 174.0334 198.9239 223.8678 231.1080 251.9561 271.3381 306.0091 330.6875 385.8599 410.2174 419.3626 426.6562 440.2678 470.4743 485.8328 507.4260 513.2997 526.5450 546.9415 570.4382 591.3016 616.5890 624.9822 635.1489 662.6913 680.4688 734.5874 749.7463 753.2378 760.8608 767.2846 785.0809 787.1259 795.2266 803.2930 822.5046 863.7202 880.5279 888.4908 898.6026 909.0361 928.6559 944.6234 953.9107 962.1219 976.2378 986.9718 989.1028 990.3931 996.8127 1013.1513 1020.6045 1025.0151 1034.3164 1042.4256 1087.3524 1098.8219 1107.1024 1148.0213 1149.3011 1168.7849 1174.2056 1175.8697 1179.1696 1194.4824 1234.4799 1235.7034 1240.2828 1267.1816 1277.9758 1300.7905 1305.9015 1364.5102 1375.2815 1398.8570 1406.7282 1407.7315 1437.0457 1441.5484 1443.7821 1452.8000 1466.7891 1489.0361 1514.2881 1584.5138 1595.2715 1596.4199 1598.9497 1615.7553 1618.2404 1629.4616 3117.8088 3118.8964 3122.5183 3125.0781 3128.6045 3132.2632 3137.8763 3142.7886 3143.1653 3154.0019 3155.3909 3161.9819 3162.2896 3168.1609 3179.4285 3538.0436
redmass: 5.2357 4.6258 4.6832 4.5234 4.0097 3.9604 4.2566 3.9803 4.4471 2.7838 1.8754 3.3171 4.3915 4.9700 4.6217 4.8632 5.5476 3.7165 3.5486 4.0816 3.2733 3.3955 5.3175 6.5760 6.2976 3.6986 3.3639 4.1353 6.7843 4.8469 6.4938 4.0114 5.9150 4.9691 2.0633 1.2873 1.5314 2.2514 3.0008 2.7262 4.3512 2.5055 1.7513 2.4966 1.4041 1.6044 1.8634 4.8300 1.5109 2.2137 1.4378 2.3035 1.4131 1.3367 1.3488 1.3655 6.1496 1.3940 3.4351 2.4292 2.1404 2.4471 2.2976 2.0922 1.8480 1.5356 1.5893 1.2659 1.1389 1.1834 1.1670 2.0116 1.7613 2.0517 1.8406 1.6015 1.7817 1.6630 1.8234 2.7330 7.0747 2.6393 3.7337 4.8234 2.2874 2.3390 2.6476 2.3032 2.5654 4.2634 3.8326 7.0230 6.6756 6.6665 5.6911 7.2304 7.1444 6.4039 1.0877 1.0865 1.0865 1.0856 1.0879 1.0905 1.0905 1.0935 1.0924 1.0953 1.0979 1.0986 1.0989 1.0985 1.0950 1.0659
irintensity: 0.1007 0.1056 0.4711 1.3529 6.6532 0.0595 5.7073 3.2412 2.7715 35.4022 47.8015 39.6115 11.6280 25.7014 18.2595 4.7468 0.8253 7.8544 5.3383 3.4917 0.2691 1.4302 0.4392 0.1425 4.0994 10.8325 0.7175 2.7927 3.8115 2.3313 22.1041 3.6710 2.2761 0.6139 84.5338 2.1957 0.8455 89.2517 29.2240 25.3475 7.6658 0.7314 85.9697 20.0378 0.2584 1.3933 1.6818 15.1964 1.7388 30.3442 0.1726 8.4800 5.2181 0.3652 0.4773 2.3424 3.3530 3.8816 3.9688 5.2123 6.3682 14.5854 2.2787 2.9814 3.0466 6.5542 13.3068 4.9264 4.4227 1.2772 5.0268 13.0381 6.4324 2.4399 2.8657 27.0286 1.2975 7.5670 14.1177 5.5542 5.9846 9.2808 1.3731 4.7905 31.1158 4.6362 15.4157 0.3075 9.1027 1.5900 12.9593 2.8673 0.7973 2.4819 4.3526 5.7479 1.4229 1.3683 7.4452 0.6153 2.3855 2.9659 2.9003 21.2232 8.4893 30.9060 14.2845 35.7454 32.3353 14.9640 40.6982 18.9727 15.8336 7.9443
temp: 298.150 k
press: 1.00000 atm
elementType: 8 6 6 6 6 6 6 6 6 6 6 6 6 6 6 6 6 6 6 6 6 6 6 6 1 1 1 1 1 1 1 1 1 1 1 1 1 1 1 1
symmnumber: 1
zpe: 823657.2 jmol-1
zpe.correction: 0.313714 hartree
zpe.thermalcorrener: 0.331613 hartree
zpe.thermalcorrenthalpy: 0.332557 hartree
zpe.thermalcorrgfe: 0.268278 hartree
zpe.sumelectzpe: -959.681728 hartree
zpe.sumelectthermal: -959.663830 hartree
zpe.sumelectthermalent: -959.662886 hartree
zpe.sumelectthermalfe: -959.727164 hartree
dipole: 0.1751 -1.2553 -0.8631
dipole: 1.5335
quadrupole: -119.5214 -125.8800 -139.3642
quadrupole: -2.4059 -3.3680 -1.7481
quadrupole: 8.7338 2.3752 -11.1090 -2.4059 -3.3680 -1.7481
hfenergy: -959.9954425 hartree
pointgroup: C01 [X(C23H16O1)]
dipole: -0.0408147 0.4773771 -0.3666389 debye
polarizability: 323.2605379|-30.6182088|271.5851313|18.341228|-15.4044893|167.4560597 unknown
InChI: InChI=1S/C23H16O/c24-23(20-15-7-9-16-8-1-2-10-17(16)20)21-13-5-3-11-18(21)19-12-4-6-14-22(19)23/h1-15,24H
charge 0 multiplicity 1
40 atoms
O  -0.11934 0.049364 2.091789
C  -0.38541 0.174438 0.624419
C  -1.606124 1.099841 0.450455
C  -0.961506 -1.183896 0.170021
C  0.873432 0.6025 -0.165314
C  -2.745402 0.357764 0.033081
C  -2.340389 -1.049153 -0.165905
C  2.208452 0.118232 0.149709
C  -1.704736 2.472411 0.729727
C  -0.319635 -2.426506 0.056658
C  -3.996787 0.991556 -0.11345
C  -3.086334 -2.16108 -0.605954
C  0.701719 1.435656 -1.282186
C  3.316758 0.531856 -0.698864
C  -2.963111 3.112092 0.587784
C  -1.069708 -3.547584 -0.383709
C  -4.097945 2.375651 0.168214
C  -2.44063 -3.416329 -0.710387
C  2.510552 -0.760331 1.251155
C  1.792806 1.828787 -2.112382
C  3.081624 1.388243 -1.823123
C  4.645592 0.071176 -0.412557
C  3.815173 -1.192285 1.500171
C  4.898225 -0.775759 0.665804
H  -0.825286 3.052708 1.034452
H  0.741304 -2.539039 0.296797
H  -4.879693 0.428201 -0.435575
H  -4.145938 -2.061323 -0.86635
H  -0.301738 1.791893 -1.53368
H  0.095675 0.954758 2.437944
H  -3.057287 4.183031 0.798551
H  -0.581102 -4.524083 -0.473842
H  -5.062951 2.883581 0.060896
H  -3.003811 -4.292391 -1.051212
H  1.697932 -1.061866 1.915369
H  1.606044 2.47851 -2.974179
H  3.930798 1.684896 -2.450403
H  5.463167 0.399253 -1.065987
H  4.011017 -1.856731 2.349382
H  5.916597 -1.121242 0.875083
