program: Gaussian 09
title: 000270657
version: EM64L-G09RevD.01
frameworkgroup: C1[X(C9H11ClN2O2)]
method: RPBEPBE
basis: SDD
operation: Freq
keyword: #p
keyword: freq=noraman
keyword: PBEPBE/SDD
title: #p freq=noraman PBEPBE/SDD
converged: YES YES NO NO
title: Mulliken charges:
elementType: Cl O O N N C C C C C C C C C H H H H H H H H H H H
charge: -0.086064 -0.434678 -0.304435 -0.486112 -0.413251 0.485976 -0.327206 -0.428358 -0.316086 0.294180 -0.550591 -0.358519 -0.344967 0.278316 0.244093 0.270409 0.289225 0.295451 0.215219 0.309296 0.280912 0.268021 0.218817 0.250174 0.350178
chargesum: 0.00000
title: Mulliken charges with hydrogens summed into heavy atoms:
elementType: Cl O O N N C C C C C C C C C
charge: -0.086064 -0.084500 -0.304435 -0.196887 -0.117800 0.485976 0.187296 -0.213138 -0.006790 0.294180 -0.001658 -0.139702 -0.094792 0.278316
polarizability: 2.07367037e+02 -2.75073320e+00 1.28376436e+02 -1.05786588e+01 -8.74793911e+00 6.46055906e+01
1716.lowfreq: 0.0016 0.0024 0.0027 1.1557 5.2401 12.8493 18.5030 42.5846 60.1681
frequency: 18.4961 42.2092 60.1580 65.9141 101.0849 120.6254 163.9506 228.5549 268.4102 300.4237 319.3644 347.2466 363.1856 403.9073 407.4390 412.5604 472.1328 518.0729 537.7253 588.6001 601.1840 630.2918 701.0150 710.8646 712.8112 766.8326 790.4577 828.8240 848.4953 859.5126 903.7466 961.5054 981.5198 987.5158 999.2174 1041.9808 1107.3477 1128.9652 1144.9164 1169.1573 1181.5185 1212.2883 1233.9231 1240.6737 1274.7947 1297.7285 1313.0281 1368.0567 1390.1107 1423.3983 1439.6830 1445.6535 1481.1294 1503.2773 1524.2036 1602.5484 1633.1425 1641.2323 2992.8684 3051.2336 3065.3149 3106.6835 3131.0678 3154.1167 3165.1660 3196.1052 3527.8702 3545.1417 3585.0340
redmass: 6.7556 5.0647 7.5091 6.0780 3.8572 5.9042 4.4575 5.0920 4.2071 5.1155 1.1142 2.9220 3.1868 2.9926 2.3684 2.5613 2.6839 2.3588 5.6935 1.8356 1.9838 6.7819 9.8763 3.8390 4.4737 4.9782 1.4087 4.0350 1.4544 2.6052 1.3730 2.4451 1.3055 2.5739 2.7588 1.9017 1.4223 2.9201 1.3400 1.4374 1.1080 1.5089 1.5964 1.7452 2.8460 1.1889 1.3946 1.3436 4.4203 3.4546 1.1085 1.1096 1.7544 2.4535 2.5019 6.4027 5.6469 4.5292 1.0597 1.0960 1.0627 1.0869 1.0969 1.1121 1.0906 1.0953 1.0762 1.0769 1.0661
irintensity: 2.2466 2.2600 2.4745 8.4015 6.2219 4.6816 1.6016 4.1666 0.3202 2.4549 144.4655 3.1087 46.1725 3.4342 10.4855 7.0640 5.6679 63.2535 14.2093 83.8616 116.0929 8.8057 11.3163 0.2473 16.5033 18.6658 52.9262 16.6236 56.0327 15.4590 2.3181 14.4507 2.7718 5.7554 2.1794 3.6568 64.7248 10.3554 249.0244 4.1459 6.4666 104.0292 236.6655 60.3709 5.7985 34.3907 28.7498 19.5276 155.7778 42.1692 7.2158 41.4760 335.1942 10.1477 747.0893 21.9909 52.4596 86.8741 58.6176 6.8108 22.6465 24.2082 17.9746 16.9478 4.3080 7.5006 6.7776 36.5686 41.4261
temp: 298.150 k
press: 1.00000 atm
elementType: 17 8 8 7 7 6 6 6 6 6 6 6 6 6 1 1 1 1 1 1 1 1 1 1 1
symmnumber: 1
zpe: 504484.5 jmol-1
zpe.correction: 0.192148 hartree
zpe.thermalcorrener: 0.206115 hartree
zpe.thermalcorrenthalpy: 0.207059 hartree
zpe.thermalcorrgfe: 0.149015 hartree
zpe.sumelectzpe: -1068.546966 hartree
zpe.sumelectthermal: -1068.532999 hartree
zpe.sumelectthermalent: -1068.532055 hartree
zpe.sumelectthermalfe: -1068.590099 hartree
dipole: -0.7046 -3.3008 0.9012
dipole: 3.4934
quadrupole: -85.5471 -84.8206 -92.0709
quadrupole: -18.7115 -0.4506 -3.4650
quadrupole: 1.9325 2.6589 -4.5914 -18.7115 -0.4506 -3.4650
hfenergy: -1068.739114 hartree
pointgroup: C01 [X(C9H11Cl1N2O2)]
dipole: -0.1943968 -1.3401263 0.2351625 debye
dipolederiv: -0.3487739 -0.1049114 -0.0577498 -0.2321133 -0.5086668 -0.0863604 -0.0689151 -0.0109989 -0.2270351 -1.6532628 -0.1391055 0.1419025 -0.207013 -0.0698498 -0.0148548 0.1629598 -0.020867 -0.4416449 -0.8700842 -0.0428524 0.0132263 0.1718665 -0.9515973 0.0162391 0.0093932 0.0550273 -0.3719977 -2.0818845 0.2095679 0.1023034 0.6945773 -0.3654091 -0.0664117 0.110636 -0.0258151 -0.3443646 -1.8378666 -0.1183744 0.0173205 -0.292624 -0.3340666 0.0314358 0.0818751 0.0190572 -0.5824088 1.3984599 0.0449378 -0.1272202 0.2854531 -0.1406712 0.0029168 -0.1779105 0.0173807 0.0919864 0.6414267 -0.1233994 -0.0400466 -0.6081992 -0.0601875 -0.0224375 -0.0282482 0.0095765 0.2529317 -0.1450302 -0.1540338 0.0043885 0.1882721 0.0878849 -0.0496143 -0.0264246 -0.0108814 -0.1923832 -0.1414311 0.1129696 -0.0205027 -0.2083914 0.0335854 -0.0009383 0.0193914 -0.0326092 -0.1535681 2.8479331 0.0109847 -0.1494793 -0.4976486 1.2855177 -0.0231285 -0.1590238 -0.093894 0.3080881 0.2544891 0.2162764 0.028417 0.3689724 0.6809161 0.0447491 0.0581237 0.0679651 0.1459296 -0.2318821 0.0910047 -0.0087534 -0.3579438 0.0357788 0.0142738 0.0409081 -0.0337265 -0.1950662 -0.2194349 -0.1076181 0.0161286 0.2622601 0.1168018 -0.0550197 -0.0196014 -0.015388 -0.1575404 1.4593047 0.1197547 -0.1652286 0.1849607 -0.0378414 -0.0093118 -0.1815276 -0.0046396 0.0742384 -0.1414984 0.0264051 0.0826819 0.0575341 0.1190692 0.0626966 0.1042347 0.0016102 -0.0859429 0.1982465 -0.0817545 -0.028049 0.0843901 0.0323713 0.0146331 -0.0709893 -0.0201439 0.1048915 0.1207005 0.0044298 0.0251392 -0.0293472 0.0767093 0.0275155 0.0234872 0.0257931 0.3043727 0.1816549 0.0146574 0.0422008 0.1041701 0.0845534 0.0027984 0.0593705 -0.0131704 0.3612172 0.0286958 -0.1064085 0.0280295 -0.0930744 -0.0749035 0.0350463 0.0251154 0.0362228 0.159293 0.190753 0.0537616 -0.0020905 0.0432868 0.0697772 0.0081491 -0.0059915 0.0048647 0.1763894 0.0695825 -0.0598331 0.0851088 -0.0734733 -0.0227308 0.0072817 0.0454366 0.0035182 -0.0466089 -0.1321615 0.0477006 -0.014865 0.0383378 -0.0645016 -0.0003459 -0.026629 -0.023133 0.1038578 -0.054129 0.1101608 0.0133122 0.1092404 -0.0205709 0.0082334 0.0151204 0.0074963 0.171329 0.0610819 -0.0553329 0.0174834 -0.0707568 -0.0285489 0.0274911 0.019605 0.026331 0.1611405 0.4051105 0.0310129 -0.0036572 0.0772635 0.0565803 0.0249631 -0.0103962 0.030424 0.3828956 unknown
polarizability: 207.511449|3.257742|129.513689|-8.8208329|-3.6003454|63.3239254 unknown
InChI: InChI=1S/C9H11ClN2O2/c10-5-6-11-9(14)12-7-1-3-8(13)4-2-7/h1-4,11-13H,5-6H2
charge 0 multiplicity 1
25 atoms
Cl -5.405428 -1.512657 -0.562868
O  5.191349 0.312984 -0.352719
O  -1.276412 1.59618 0.269234
N  -0.359847 -0.581426 0.379358
N  -2.669721 -0.255766 0.575546
C  1.029262 -0.31787 0.193423
C  -3.885753 0.554885 0.604337
C  1.912587 -1.428462 0.206455
C  1.560206 0.987086 -0.002043
C  -1.414584 0.340082 0.395721
C  -4.805628 0.295836 -0.588736
C  3.29996 -1.250651 0.02816
C  2.945546 1.161257 -0.181107
C  3.818772 0.050804 -0.167065
H  -4.441608 0.39163 1.547112
H  -3.558068 1.611981 0.575768
H  -0.594955 -1.564652 0.529393
H  -2.787315 -1.270677 0.582542
H  1.518892 -2.442256 0.356043
H  0.88242 1.842204 -0.008924
H  -4.289709 0.413172 -1.552342
H  -5.72369 0.900509 -0.546613
H  3.965833 -2.123077 0.041962
H  3.365552 2.16009 -0.332323
H  5.715341 -0.525401 -0.326218
