program: Gaussian 09
title: 000270642
version: EM64L-G09RevD.01
frameworkgroup: C1[X(C13H11FN2O3S)]
method: RPBEPBE
basis: SDD
operation: Freq
keyword: #p
keyword: freq=noraman
keyword: PBEPBE/SDD
title: #p freq=noraman PBEPBE/SDD
converged: YES YES NO NO
title: Mulliken charges:
elementType: S F O O O N N C C C C C C C C C C C C C H H H H H H H H H H H
charge: 1.087407 -0.351154 -0.265776 -0.487501 -0.482821 -0.482791 -0.681532 0.517568 -0.141891 0.262505 -0.313822 -0.431180 -0.209031 -0.188031 0.143673 -0.326954 -0.315033 0.508412 -0.411924 -0.431497 0.327391 0.236051 0.311956 0.283697 0.284658 0.273292 0.199107 0.227508 0.224921 0.315457 0.317334
chargesum: 0.00000
title: Mulliken charges with hydrogens summed into heavy atoms:
elementType: S F O O O N N C C C C C C C C C C C C C
charge: 1.087407 -0.351154 -0.265776 -0.487501 -0.482821 -0.170834 -0.048742 0.517568 -0.141891 0.262505 0.013570 -0.195129 0.074667 0.096627 0.143673 -0.053662 -0.115926 0.508412 -0.184416 -0.206577
polarizability: 4.29031427e+02 9.09263712e+00 1.83013000e+02 -2.53191181e+00 4.15598388e-01 8.93759773e+01
1716.lowfreq: -7.3360 -1.3879 0.0010 0.0013 0.0015 2.4868 21.9402 25.0085 37.9987
frequency: 20.6254 24.6707 37.9982 53.6673 68.5654 99.3893 110.0826 125.9585 155.1171 185.7301 216.1733 244.0659 276.5871 281.1655 306.6689 328.2032 361.2332 369.7151 385.4210 407.1865 412.9420 416.8350 428.4944 437.6996 463.4469 505.6809 515.1742 553.3944 590.4199 618.7422 632.1001 638.6662 652.3382 686.7791 715.9312 757.7688 802.0826 811.4914 823.3914 827.1863 845.4715 851.2015 861.1781 863.3856 935.7151 957.9068 980.2505 986.8264 990.9906 996.3644 1001.4806 1021.5470 1049.1731 1072.0384 1122.4774 1138.5675 1185.3733 1194.5739 1253.1021 1271.7495 1295.9327 1314.8661 1335.1420 1366.6977 1386.7178 1417.6005 1449.9826 1473.5911 1496.2801 1521.5753 1561.4971 1584.9511 1597.9492 1608.8644 1634.2268 1649.3152 3105.3848 3129.9166 3130.4276 3138.5618 3162.4489 3163.7070 3169.3604 3197.5608 3536.2525 3558.7870 3697.6913
redmass: 6.5434 5.9614 5.5106 5.7791 7.4848 6.8368 7.2603 8.1507 9.3104 7.2340 8.6293 8.5972 6.4880 7.3551 7.9516 9.9361 6.7209 4.4482 4.4895 2.2348 2.9967 1.1446 8.5660 1.2554 6.0138 3.0506 3.0655 9.1581 6.7776 7.1014 2.6622 1.9339 5.6113 3.5157 3.1922 4.4459 2.6233 1.9401 5.1617 1.4136 1.7306 16.2207 1.4508 6.4503 1.4038 1.3461 5.5377 1.3881 16.3229 2.9318 1.3214 1.4485 2.5544 3.3195 1.3118 1.2329 1.1280 1.1343 2.3399 2.3412 1.4231 1.4274 2.6318 3.9727 4.2153 5.4169 4.3191 2.3693 2.4639 3.0994 6.4391 7.1306 5.6327 4.3070 3.1657 1.4413 1.0875 1.0901 1.0895 1.0954 1.0916 1.0955 1.0957 1.0954 1.0757 1.0452 1.1040
irintensity: 0.1930 0.1758 2.5872 0.3830 4.7124 1.4226 3.7923 1.5562 1.0252 3.6976 8.4108 11.9084 7.9308 8.9210 1.2522 11.4818 4.4475 12.9171 1.7101 2.9402 0.2528 8.0979 43.8100 307.0658 21.3369 30.3909 17.9757 199.1188 95.6783 18.8205 17.4020 16.9794 9.7360 35.1391 4.4504 18.0685 17.2324 4.4809 4.8818 35.8322 51.1227 151.1412 61.9914 12.4397 0.5478 1.2161 24.2194 2.7707 76.5226 3.0149 4.3786 2.9412 79.8233 93.6262 14.0004 38.5296 42.7473 219.9066 430.8336 9.2513 121.8071 43.5518 65.7250 409.9584 6.0133 17.3669 0.8029 17.8490 732.2782 21.6761 57.9115 88.8558 243.7205 401.3994 69.9566 339.4082 24.4067 10.0597 18.6450 18.8313 3.9196 7.2707 5.9231 15.8530 18.6362 166.7937 26.1361
temp: 298.150 k
press: 1.00000 atm
elementType: 16 9 8 8 8 7 7 6 6 6 6 6 6 6 6 6 6 6 6 6 1 1 1 1 1 1 1 1 1 1 1
symmnumber: 1
zpe: 577876.8 jmol-1
zpe.correction: 0.220102 hartree
zpe.thermalcorrener: 0.238792 hartree
zpe.thermalcorrenthalpy: 0.239736 hartree
zpe.thermalcorrgfe: 0.170925 hartree
zpe.sumelectzpe: -1333.497951 hartree
zpe.sumelectthermal: -1333.479261 hartree
zpe.sumelectthermalent: -1333.478317 hartree
zpe.sumelectthermalfe: -1333.547128 hartree
dipole: -14.1430 -4.0381 -0.9798
dipole: 14.7408
quadrupole: -114.2560 -116.8025 -132.6504
quadrupole: 11.3190 -2.1326 -0.7142
quadrupole: 6.9803 4.4338 -11.4141 11.3190 -2.1326 -0.7142
hfenergy: -1333.7180528 hartree
pointgroup: C01 [X(C13H11F1N2O3S1)]
dipole: 5.5549873 -1.6244293 0.3705701 debye
polarizability: 428.9816587|-9.9768558|182.9748041|0.0516765|3.1927623|89.4639411 unknown
InChI: InChI=1S/C13H11FN2O3S/c14-20(18,19)12-7-5-11(6-8-12)16-13(17)9-1-3-10(15)4-2-9/h1-8,16H,15H2
charge 0 multiplicity 1
31 atoms
S  -5.476233 -0.053318 0.056657
F  -5.742322 -0.284779 -1.774518
O  1.217919 1.953429 0.011043
O  -6.086444 -1.373571 0.744687
O  -6.021714 1.422088 0.388583
N  0.566679 -0.29897 0.131213
N  7.080922 -0.77413 -0.021991
C  -0.836444 -0.179889 0.109381
C  -3.623885 -0.10118 0.073937
C  2.956066 0.265272 0.01608
C  -1.510104 1.069236 -0.040538
C  -1.596022 -1.38098 0.247313
C  -2.915982 1.105265 -0.066728
C  -2.998673 -1.352497 0.226045
C  1.537984 0.724912 0.043843
C  3.962185 1.240445 0.265215
C  3.373637 -1.065772 -0.268477
C  5.735311 -0.434803 -0.012765
C  5.321278 0.905917 0.258736
C  4.732806 -1.414972 -0.285174
H  -0.921591 1.983258 -0.129908
H  -1.082726 -2.34249 0.368457
H  0.924596 -1.247401 0.259683
H  -3.446991 2.055667 -0.17906
H  -3.589094 -2.266881 0.3362
H  3.639884 2.268126 0.461931
H  2.648483 -1.847786 -0.529117
H  6.075923 1.67521 0.460904
H  5.030342 -2.443255 -0.522062
H  7.380897 -1.72545 -0.216905
H  7.796013 -0.075303 0.160836
