program: Gaussian 09
title: 000270640
version: EM64L-G09RevD.01
frameworkgroup: C1[X(C14H13FN2O3S)]
method: RPBEPBE
basis: SDD
operation: Freq
keyword: #p
keyword: freq=noraman
keyword: PBEPBE/SDD
title: #p freq=noraman PBEPBE/SDD
converged: YES YES NO NO
title: Mulliken charges:
elementType: S F O O O N N C C C C C C C C C C C C C C H H H H H H H H H H H H H
charge: 1.088079 -0.350065 -0.247447 -0.481492 -0.486180 -0.456918 -0.690747 -0.658931 0.382254 0.495110 0.191399 -0.138141 -0.365081 -0.366187 -0.424887 -0.316040 -0.187672 -0.209044 0.477677 -0.406314 -0.406498 0.258208 0.257846 0.350513 0.247074 0.325640 0.238892 0.238779 0.285316 0.284768 0.223861 0.223700 0.311173 0.311359
chargesum: 0.00000
title: Mulliken charges with hydrogens summed into heavy atoms:
elementType: S F O O O N N C C C C C C C C C C C C C C
charge: 1.088079 -0.350065 -0.247447 -0.481492 -0.486180 -0.106405 -0.068215 -0.142877 0.382254 0.495110 0.191399 -0.138141 -0.126189 -0.127408 -0.177813 0.009600 0.097644 0.075723 0.477677 -0.182454 -0.182799
polarizability: 2.89975146e+02 -8.24552518e+00 2.23752462e+02 2.83867576e+00 1.87423075e+00 1.37142439e+02
1716.lowfreq: 0.0011 0.0016 0.0017 1.9392 2.9479 6.1096 14.3442 28.2194 30.6589
frequency: 12.5291 28.0038 30.6575 32.0818 45.9776 73.3549 88.7413 106.9332 129.4141 165.0872 184.7192 216.1296 233.9639 280.7674 289.0621 305.2259 326.4124 347.5596 362.1254 386.3650 388.0345 391.1853 392.6381 410.8105 413.2023 428.0898 493.4177 507.4812 539.2409 555.4482 564.5257 572.6895 616.5447 639.2335 678.2566 716.1301 726.3767 727.1733 786.4102 822.5344 823.6040 830.1502 833.6186 850.5962 856.0044 861.5505 912.4032 923.2836 946.0161 959.4670 962.2655 982.1243 991.7047 1000.4856 1001.7731 1020.0270 1050.3256 1123.1299 1128.8138 1166.9644 1178.5514 1185.7348 1191.0361 1219.0414 1272.7241 1289.7094 1299.4536 1321.0766 1322.1508 1373.8890 1384.2322 1415.8905 1437.5573 1443.1253 1473.8250 1503.0440 1522.0403 1575.5048 1586.7623 1597.8030 1621.8923 1633.7868 1647.4522 3004.2244 3056.2899 3114.3994 3115.9834 3135.9421 3136.1795 3142.2107 3162.1952 3170.3245 3194.3152 3453.1307 3564.5319 3703.4223
redmass: 7.1366 4.0352 6.3300 6.7882 5.2936 5.5103 8.4717 8.5401 6.3034 9.0882 7.1924 8.3654 11.4841 2.2462 9.0668 7.0943 10.7258 6.7657 7.1753 1.0527 2.4640 1.6596 2.6811 2.6872 3.0028 12.2120 4.0667 3.4221 5.5218 6.6072 4.1662 3.6000 7.1390 6.7241 5.4386 2.4888 3.0786 1.3901 4.0703 1.2879 2.1209 5.6084 1.3522 9.6393 4.2890 1.4739 2.0836 5.2432 1.4139 1.3516 1.3525 5.5166 16.0159 2.8293 1.3312 1.4369 2.4345 1.3056 1.2582 3.6529 1.1303 1.1357 1.1007 2.2209 1.9346 1.6196 1.3826 1.2767 3.1909 4.1286 5.0295 5.0344 3.4210 1.1046 2.2702 2.3719 3.1278 6.5682 7.0222 5.0185 6.1317 2.5343 1.5983 1.0609 1.0995 1.0872 1.0872 1.0963 1.0903 1.0974 1.0915 1.0959 1.0956 1.0762 1.0452 1.1040
irintensity: 0.4400 0.3454 1.6241 1.9590 0.5236 4.4758 1.4714 0.3580 4.4174 1.6000 7.2529 3.8574 6.0276 4.7475 7.8598 5.3889 25.6692 4.8651 2.6991 0.4540 1.0522 205.3488 126.4927 0.0391 0.0109 25.7623 2.6067 16.9928 57.2156 96.5652 146.0512 28.3851 1.1681 0.2027 5.8790 9.8595 4.0774 13.8388 5.9737 3.5850 43.7087 0.5263 24.3015 136.5526 13.0582 60.4080 5.1687 5.8630 0.3414 0.1027 1.1883 10.7597 78.7261 0.6235 3.4189 0.0280 64.5441 13.2222 18.3863 99.9305 1.5280 14.3887 24.7384 4.5996 19.7723 31.5672 23.8720 1.0342 75.8240 219.8531 8.6277 16.8999 0.1258 29.8086 1.5759 711.1691 128.5054 3.3627 108.3047 81.4820 294.8675 10.0292 261.4266 14.7580 2.6355 0.4656 26.8300 32.5159 7.1846 3.6320 3.8731 5.6888 11.5024 201.2242 87.8692 23.6579
temp: 298.150 k
press: 1.00000 atm
elementType: 16 9 8 8 8 7 7 6 6 6 6 6 6 6 6 6 6 6 6 6 6 1 1 1 1 1 1 1 1 1 1 1 1 1
symmnumber: 1
zpe: 650100.2 jmol-1
zpe.correction: 0.247610 hartree
zpe.thermalcorrener: 0.267748 hartree
zpe.thermalcorrenthalpy: 0.268692 hartree
zpe.thermalcorrgfe: 0.195337 hartree
zpe.sumelectzpe: -1372.719612 hartree
zpe.sumelectthermal: -1372.699474 hartree
zpe.sumelectthermalent: -1372.698530 hartree
zpe.sumelectthermalfe: -1372.771885 hartree
dipole: 11.8892 -3.3351 -0.6058
dipole: 12.3630
quadrupole: -152.0098 -128.3292 -127.4695
quadrupole: -27.5433 1.8719 0.1487
quadrupole: -16.0736 7.6069 8.4667 -27.5433 1.8719 0.1487
hfenergy: -1372.967222 hartree
pointgroup: C01 [X(C14H13F1N2O3S1)]
dipole: 4.7501943 0.9973084 -0.3151059 debye
polarizability: 290.0163332|1.2145909|216.5072235|-11.4145156|-22.7334981|144.3464904 unknown
InChI: InChI=1S/C14H13FN2O3S/c15-21(19,20)13-7-5-12(6-8-13)17-14(18)9-10-1-3-11(16)4-2-10/h1-8,17H,9,16H2
charge 0 multiplicity 1
34 atoms
S  -5.096767 1.066565 0.00498
F  -5.469463 0.676065 -1.779734
O  0.402539 -3.21011 0.865983
O  -6.090105 0.141829 0.866211
O  -5.110332 2.672117 0.102466
N  0.596862 -0.962775 0.204894
N  5.481509 2.465621 -1.150371
C  2.655216 -2.32432 0.458562
C  3.407834 -1.074073 0.038165
C  -0.749199 -0.542742 0.171622
C  1.114235 -2.220396 0.532456
C  -3.358575 0.419116 0.067117
C  3.687977 -0.806473 -1.329473
C  3.84679 -0.119385 0.99522
C  -1.001247 0.81243 -0.194509
C  -1.835752 -1.409621 0.489672
C  -2.314364 1.305281 -0.254704
C  -3.155023 -0.923088 0.430531
C  4.803176 1.312558 -0.762656
C  4.368512 0.358627 -1.730853
C  4.528425 1.051699 0.613135
H  2.862155 -3.166681 -0.227672
H  2.977421 -2.668874 1.459087
H  1.308675 -0.264717 -0.04315
H  -0.164461 1.478162 -0.435166
H  -1.62871 -2.443196 0.772081
H  3.374538 -1.528458 -2.094039
H  3.658892 -0.30067 2.061045
H  -2.521443 2.343797 -0.529383
H  -4.001873 -1.572165 0.674127
H  4.575844 0.531168 -2.793929
H  4.860801 1.764518 1.377557
H  5.808777 3.135997 -0.460852
H  5.693532 2.642899 -2.127921
