program: Gaussian 09
title: 000270639
version: EM64L-G09RevD.01
frameworkgroup: C1[X(C14H11FN2O5S)]
method: RPBEPBE
basis: SDD
operation: Freq
keyword: #p
keyword: freq=noraman
keyword: PBEPBE/SDD
title: #p freq=noraman PBEPBE/SDD
converged: YES YES NO NO
title: Mulliken charges:
elementType: S F O O O O O N N C C C C C C C C C C C C C C H H H H H H H H H H H
charge: 1.091920 -0.345767 -0.235046 -0.476484 -0.480183 -0.198655 -0.198175 -0.457282 0.029102 -0.652510 0.400025 0.502676 0.197605 -0.136229 -0.363452 -0.340131 -0.425066 -0.312599 -0.187147 -0.205645 0.364492 -0.349523 -0.348209 0.265782 0.267578 0.341599 0.258539 0.257874 0.245275 0.325095 0.289323 0.287158 0.294273 0.293787
chargesum: 0.00000
title: Mulliken charges with hydrogens summed into heavy atoms:
elementType: S F O O O O O N N C C C C C C C C C C C C C C
charge: 1.091920 -0.345767 -0.235046 -0.476484 -0.480183 -0.198655 -0.198175 -0.115683 0.029102 -0.119150 0.400025 0.502676 0.197605 -0.136229 -0.104913 -0.082257 -0.179791 0.012496 0.102175 0.081514 0.364492 -0.055250 -0.054422
polarizability: 3.04937847e+02 -1.78983233e+01 2.31608213e+02 6.30410388e+00 -2.84042467e+00 1.50839280e+02
1716.lowfreq: -11.0422 -6.5629 -5.4328 -0.0006 0.0008 0.0015 2.9229 6.4797 21.4682
frequency: -7.0287 -5.1649 21.4315 27.4692 42.7768 63.8864 69.8461 81.6907 102.2299 112.6585 162.9127 179.9717 204.3503 210.1740 232.2575 279.7648 292.6779 304.5483 325.2326 331.4039 363.2921 382.8906 406.4497 407.6798 411.7582 440.2902 482.6008 503.4029 509.0315 539.2102 564.1223 576.9315 614.6896 627.3603 643.6596 667.0767 680.9967 689.6622 719.4093 737.4165 773.7126 823.1996 831.6302 835.0287 853.1474 857.1931 861.5858 878.2772 922.3423 924.3365 962.2227 983.6828 988.9963 993.8012 997.5354 1000.6187 1005.1851 1050.2178 1091.7240 1107.8666 1123.8605 1169.2133 1182.1788 1186.4122 1187.2497 1215.4738 1219.0329 1267.2493 1290.6683 1301.9688 1302.8823 1369.7004 1375.4228 1397.2517 1411.1802 1417.6095 1449.8713 1473.2438 1481.1111 1506.3137 1590.7168 1594.2306 1598.0053 1605.5970 1628.1372 3012.0189 3069.9686 3134.7251 3139.9189 3143.2039 3163.2122 3170.5093 3182.6535 3184.7978 3198.0153 3489.2778
redmass: 5.6009 6.3430 11.9794 8.1493 7.1331 7.6126 5.6530 9.3951 9.0539 8.8059 9.3355 7.8050 5.4202 7.3348 12.5292 7.4520 9.4799 10.4901 9.0543 2.6846 7.1082 6.1872 5.2948 3.3266 2.9919 9.7511 5.3247 5.6489 3.8357 5.6288 7.8419 3.7441 7.1070 6.9225 6.4185 5.8079 4.5372 1.2177 3.0781 4.8595 7.4859 5.2284 1.3758 3.0930 14.5963 1.2481 1.4497 2.2272 2.0528 5.4446 1.3557 5.3593 1.3421 12.9799 1.3705 1.3614 3.0531 2.4396 3.3104 1.3295 1.3111 2.3200 1.3401 1.1494 1.4166 2.8900 4.2219 2.0596 1.4771 1.3401 1.3566 7.1470 4.2649 8.0171 4.8248 3.4634 1.1169 2.3429 2.4535 2.1836 6.8059 7.6206 5.3914 5.9677 5.8936 1.0616 1.0995 1.0905 1.0908 1.0911 1.0917 1.0959 1.0943 1.0955 1.0955 1.0763
irintensity: 0.7467 3.4113 1.2504 3.2666 0.0363 0.0124 5.9249 2.6915 1.6170 1.8367 1.3496 3.3399 0.3750 0.3982 4.3794 18.3767 2.8610 9.6983 16.1430 2.8105 2.3964 5.1928 26.3069 7.1991 0.2988 15.4743 3.1840 4.7448 20.2835 49.3203 219.5694 11.2491 1.3834 0.2307 5.5097 32.7903 13.7017 27.8340 1.4179 4.3406 25.6155 7.3761 24.9202 10.4091 133.4337 0.2629 61.1571 14.3232 1.8011 16.2988 0.9175 6.1440 1.9456 77.2374 0.0847 4.2956 4.6186 56.7665 18.8371 20.3206 15.7877 126.5562 73.4670 34.4998 12.8214 59.8290 227.9322 59.6569 37.1248 8.0836 4.9365 86.3279 206.5923 0.7219 20.2790 55.9457 27.9822 27.9658 7.5135 563.6625 133.2528 7.0854 50.7886 102.3546 182.9904 5.8628 1.1495 7.9660 6.7124 3.9765 3.9396 6.5197 0.5026 4.8654 10.3630 80.9055
temp: 298.150 k
press: 1.00000 atm
elementType: 16 9 8 8 8 8 8 7 7 6 6 6 6 6 6 6 6 6 6 6 6 6 6 1 1 1 1 1 1 1 1 1 1 1
symmnumber: 1
zpe: 610026.1 jmol-1
zpe.correction: 0.232347 hartree
zpe.thermalcorrener: 0.251826 hartree
zpe.thermalcorrenthalpy: 0.252771 hartree
zpe.thermalcorrgfe: 0.181947 hartree
zpe.sumelectzpe: -1521.739252 hartree
zpe.sumelectthermal: -1521.719772 hartree
zpe.sumelectthermalent: -1521.718828 hartree
zpe.sumelectthermalfe: -1521.789652 hartree
dipole: 6.4935 4.0895 0.1927
dipole: 7.6764
quadrupole: -207.1163 -157.9878 -139.1667
quadrupole: 12.8969 3.7479 0.0896
quadrupole: -39.0260 10.1024 28.9236 12.8969 3.7479 0.0896
hfenergy: -1521.9715988 hartree
pointgroup: C01 [X(C14H11F1N2O5S1)]
dipole: 2.5337667 -1.6343045 0.1736398 debye
polarizability: 303.4427586|12.1519425|224.0288863|-21.1627789|-23.3276366|159.9136948 unknown
InChI: InChI=1S/C14H11FN2O5S/c15-23(21,22)13-7-3-11(4-8-13)16-14(18)9-10-1-5-12(6-2-10)17(19)20/h1-8,16H,9H2
charge 0 multiplicity 1
34 atoms
S  -5.695471 1.247687 0.093147
F  -6.228108 0.717988 -1.608821
O  -0.433902 -3.322746 0.905489
O  -6.665799 0.473802 1.113504
O  -5.595951 2.851241 0.038133
O  5.393727 2.194821 -2.236098
O  5.533946 2.690984 -0.012538
N  -0.137229 -1.154794 0.052941
N  5.124267 1.962498 -0.995662
C  1.830671 -2.672282 0.25249
C  2.696395 -1.471017 -0.076069
C  -1.458737 -0.644654 0.081559
C  0.313533 -2.416813 0.4444
C  -3.998832 0.486137 0.082804
C  3.029661 -1.158759 -1.422634
C  3.180642 -0.626692 0.961483
C  -1.647492 0.692821 -0.371533
C  -2.569644 -1.408038 0.541647
C  -2.927507 1.270965 -0.379046
C  -3.855804 -0.835178 0.537068
C  4.283287 0.778057 -0.678366
C  3.823726 -0.036826 -1.734827
C  3.975723 0.498728 0.671301
H  1.907064 -3.441298 -0.538648
H  2.163614 -3.15877 1.186359
H  0.584374 -0.514457 -0.293631
H  2.675599 -1.808309 -2.231257
H  2.939448 -0.861364 2.0044
H  -0.791457 1.281431 -0.721522
H  -2.413172 -2.429905 0.889978
H  -3.086388 2.298548 -0.719224
H  -4.721592 -1.40354 0.890757
H  4.095414 0.211441 -2.7642
H  4.362091 1.152794 1.457417
