program: Gaussian 09
title: 000270634
version: EM64L-G09RevD.01
frameworkgroup: C1[X(C15H15FN2O3S)]
method: RPBEPBE
basis: SDD
operation: Freq
keyword: #p
keyword: freq=noraman
keyword: PBEPBE/SDD
title: #p freq=noraman PBEPBE/SDD
converged: YES YES NO NO
title: Mulliken charges:
elementType: S F O O O N N C C C C C C C C C C C C C C C H H H H H H H H H H H H H H H
charge: 1.089861 -0.348566 -0.240137 -0.484477 -0.479735 -0.462023 -0.694956 -0.565193 -0.561121 0.511931 0.232927 0.509972 -0.392589 -0.403848 -0.137010 -0.425873 -0.312860 -0.412207 -0.411565 0.481393 -0.188293 -0.208562 0.251858 0.215702 0.224457 0.261149 0.231337 0.225123 0.314120 0.240344 0.326046 0.215709 0.214973 0.286856 0.285469 0.305192 0.304594
chargesum: 0.00000
title: Mulliken charges with hydrogens summed into heavy atoms:
elementType: S F O O O N N C C C C C C C C C C C C C C C
charge: 1.089861 -0.348566 -0.240137 -0.484477 -0.479735 -0.147903 -0.085170 -0.097633 -0.075515 0.511931 0.232927 0.509972 -0.161251 -0.178724 -0.137010 -0.185528 0.013186 -0.196498 -0.196592 0.481393 0.098563 0.076907
polarizability: 4.12782701e+02 6.00806540e+00 1.90759942e+02 1.53926163e+01 -2.19092989e+00 1.23646554e+02
1716.lowfreq: -5.7888 -1.3336 -0.0024 -0.0022 -0.0017 3.3275 10.8014 14.3705 21.2135
frequency: 10.0444 14.2420 21.1811 29.0418 39.7754 54.4697 70.5570 89.9622 107.3074 133.7408 153.2097 185.1257 209.0207 220.2379 236.7872 287.1903 295.7692 310.0181 328.1526 342.4320 365.9270 366.8999 379.7389 392.4176 396.2190 409.4041 412.7320 444.5508 481.2670 509.9041 529.8793 553.6259 576.5333 615.4412 639.3528 642.6457 662.6065 706.4209 719.1543 725.7055 775.6579 793.9675 816.8685 819.9850 828.3670 829.2303 841.6558 852.1681 862.9771 930.9120 945.7984 952.7359 959.4421 981.7922 989.5186 992.1847 1000.3832 1003.2039 1017.7752 1023.6457 1050.2882 1111.7010 1123.7078 1137.9530 1185.0934 1187.4169 1190.7683 1222.2389 1263.3542 1269.4336 1288.4148 1299.9035 1314.5574 1322.4918 1333.4403 1368.4248 1386.6902 1413.6796 1435.5537 1446.8662 1472.7380 1481.0029 1495.3008 1521.2993 1581.7809 1588.2256 1597.4124 1629.7254 1633.0909 1644.8927 2983.9643 2998.8202 3038.2235 3067.5876 3106.2300 3108.5492 3129.4543 3132.8319 3136.3383 3163.3053 3170.3153 3197.1929 3526.8620 3568.0296 3708.0287
redmass: 5.0875 5.9272 5.7691 5.4168 3.9722 5.7567 6.1902 6.3171 8.0004 8.5414 4.6083 5.8500 6.8515 8.5878 10.0359 3.1871 6.2578 5.0448 6.8391 1.3043 6.4496 1.0519 6.0161 2.6648 4.9125 2.7016 3.0085 8.6183 5.1531 3.3857 2.6063 8.1882 3.8118 6.7744 6.5080 4.8184 1.2443 5.6127 3.3927 3.3669 1.3987 3.7785 1.4387 1.9250 3.9678 1.4015 3.5974 16.4318 1.4422 1.9284 2.7265 1.3583 1.3546 5.1441 1.8315 14.5693 2.8823 1.3271 4.0491 1.5220 2.4309 1.3953 1.3109 1.2765 1.2217 1.1140 1.5243 2.3313 1.4363 1.7892 1.3162 1.4386 3.1404 1.2538 1.4405 3.8042 5.2265 5.1898 3.2596 1.1159 2.2839 1.0995 2.3010 3.1271 6.6372 6.9774 5.4360 4.8884 1.9754 1.9574 1.0593 1.0612 1.0997 1.1037 1.0869 1.0869 1.0961 1.0903 1.0971 1.0916 1.0958 1.0955 1.0765 1.0449 1.1040
irintensity: 0.1445 0.2858 0.0269 2.7391 1.2811 1.7589 2.0450 4.0312 0.1512 3.2251 4.3497 12.9717 3.3806 1.7565 7.2338 8.9401 0.5932 1.6727 24.1233 310.1133 10.1977 2.4687 4.6232 1.8180 8.7125 0.0587 0.0266 51.3007 29.3538 16.4794 20.7291 174.7102 81.4214 2.6492 2.7058 15.4978 41.4907 6.8739 1.2451 0.1720 7.2935 8.6572 10.9553 30.6742 11.0400 37.2889 22.4922 135.9617 61.7410 2.8524 7.2038 0.0352 1.2217 11.9644 6.5882 73.1346 0.5462 3.4955 5.3437 5.1740 62.8480 82.0220 9.2205 44.8772 108.6838 25.0592 24.0372 1.3371 82.1560 5.8036 4.2524 73.2849 70.7215 0.4020 48.3702 326.6203 10.5090 17.9857 0.2639 16.8790 17.2909 20.2226 577.9011 124.8233 2.5957 104.3547 109.5438 126.1338 0.3719 304.4857 8.9226 27.8981 4.0067 18.9600 6.4381 34.8577 45.5662 8.7656 5.7234 4.1250 6.2438 14.8737 17.8825 90.0344 20.6247
temp: 298.150 k
press: 1.00000 atm
elementType: 16 9 8 8 8 7 7 6 6 6 6 6 6 6 6 6 6 6 6 6 6 6 1 1 1 1 1 1 1 1 1 1 1 1 1 1 1
symmnumber: 1
zpe: 723263.0 jmol-1
zpe.correction: 0.275476 hartree
zpe.thermalcorrener: 0.297182 hartree
zpe.thermalcorrenthalpy: 0.298126 hartree
zpe.thermalcorrgfe: 0.219798 hartree
zpe.sumelectzpe: -1411.938323 hartree
zpe.sumelectthermal: -1411.916617 hartree
zpe.sumelectthermalent: -1411.915673 hartree
zpe.sumelectthermalfe: -1411.994001 hartree
dipole: -11.6031 -3.6746 -2.3153
dipole: 12.3893
quadrupole: -156.4767 -131.9681 -141.3699
quadrupole: 8.4859 2.6860 -1.7790
quadrupole: -13.2051 11.3035 1.9017 8.4859 2.6860 -1.7790
hfenergy: -1412.2137989 hartree
pointgroup: C01 [X(C15H15F1N2O3S1)]
dipole: 4.5553838 -1.7326477 -0.0739336 debye
polarizability: 412.3300316|-15.9799867|164.9886159|12.260465|32.5054248|149.870549 unknown
InChI: InChI=1S/C15H15FN2O3S/c16-22(20,21)14-8-6-13(7-9-14)18-15(19)10-3-11-1-4-12(17)5-2-11/h1-2,4-9,18H,3,10,17H2
charge 0 multiplicity 1
37 atoms
S  -6.551147 -0.065217 -0.079738
F  -6.723212 0.660295 -1.786901
O  0.183156 1.542454 1.000714
O  -7.205545 -1.531867 -0.166999
O  -7.093364 1.064254 0.926888
N  -0.516451 -0.507371 0.092375
N  8.341262 -0.912222 -0.029467
C  2.852329 0.930726 -0.194882
C  1.897794 -0.12039 0.450339
C  4.301186 0.47158 -0.167064
C  0.46343 0.396903 0.546065
C  -1.921547 -0.350958 0.071589
C  5.110442 0.673518 0.981255
C  4.884726 -0.205828 -1.267997
C  -4.698481 -0.176326 -0.022294
C  -2.694618 -1.442667 -0.421989
C  -2.57136 0.834743 0.523307
C  6.442477 0.220754 1.036317
C  6.215813 -0.666928 -1.233089
C  7.019903 -0.461812 -0.074503
C  -4.095243 -1.362095 -0.47851
C  -3.974969 0.922792 0.470446
H  2.723059 1.878604 0.358258
H  2.52681 1.117984 -1.235732
H  1.960073 -1.076634 -0.104064
H  2.251651 -0.32284 1.479934
H  4.693576 1.206823 1.845614
H  4.290823 -0.367203 -2.177316
H  -0.163002 -1.39971 -0.26162
H  -2.19702 -2.357198 -0.765748
H  -1.969927 1.662556 0.901689
H  7.045706 0.399818 1.935169
H  6.641407 -1.180052 -2.104549
H  -4.699343 -2.194606 -0.851114
H  -4.490992 1.823563 0.81693
H  8.918259 -0.75268 0.790792
H  8.757737 -1.386362 -0.825002
