program: Gaussian 09
title: 000270631
version: EM64L-G09RevD.01
frameworkgroup: C1[X(C14H21N3O6S)]
method: RPBEPBE
basis: SDD
operation: Freq
keyword: #p
keyword: freq=noraman
keyword: PBEPBE/SDD
title: #p freq=noraman PBEPBE/SDD
converged: YES YES NO NO
title: Mulliken charges:
elementType: S O O O O O O N N N C C C C C C C C C C C C C C H H H H H H H H H H H H H H H H H H H H H
charge: 0.215659 -0.170998 -0.413009 -0.200359 -0.281199 -0.425389 -0.247666 -0.089433 -0.377761 -0.643417 -0.454142 -0.131927 -0.179092 -0.142261 0.075535 -0.675270 -0.656614 0.182122 0.278986 -0.587234 -0.395731 -0.440348 -0.157408 0.177388 0.317825 0.300386 0.317795 0.235160 0.230875 0.247847 0.249836 0.217110 0.242148 0.316908 0.248691 0.234705 0.386373 0.237825 0.228235 0.231719 0.237003 0.246877 0.343482 0.292507 0.376261
chargesum: 0.00000
title: Mulliken charges with hydrogens summed into heavy atoms:
elementType: S O O O O O O N N N C C C C C C C C C C C C C C
charge: 0.215659 -0.170998 -0.026636 -0.200359 -0.281199 -0.049129 -0.247666 -0.089433 -0.060853 -0.007428 -0.136316 -0.131927 0.121294 0.175533 0.075535 0.038612 0.052480 0.182122 0.278986 -0.103838 0.070328 0.028375 0.089469 0.177388
polarizability: 2.72895654e+02 -6.48892872e+00 1.84491306e+02 -9.24592279e+00 -3.03742506e+00 1.68724693e+02
1716.lowfreq: -12.5605 -1.9680 -0.0020 -0.0013 -0.0008 5.8305 10.6413 17.5875 23.1565
frequency: 10.3928 16.7631 22.1471 31.0450 36.9875 51.0321 61.6562 63.2555 70.0934 91.5106 103.9582 114.5626 139.8866 179.6572 200.2698 215.6218 230.6429 235.5668 242.2090 255.9498 269.6278 270.3618 285.0358 306.0854 318.7556 330.6099 342.9997 356.3443 380.2966 385.6076 419.3637 440.8207 462.4529 470.6613 494.3738 514.8734 530.4985 553.4433 557.4188 584.4683 590.6882 595.3483 612.3763 619.0210 647.2621 679.8092 694.2014 704.2272 721.7253 765.1475 773.8275 791.8356 833.2658 862.5438 865.6684 892.3520 908.6813 934.8747 948.5571 963.7320 969.8323 981.6709 1006.0451 1011.8838 1031.3288 1037.8554 1045.7656 1072.5644 1078.7088 1109.7878 1117.6300 1142.2587 1158.7056 1167.8886 1173.9572 1191.7748 1197.1313 1208.2558 1220.6433 1229.3444 1238.0864 1240.4516 1262.6333 1272.7247 1286.3777 1289.8191 1305.0628 1311.6624 1320.6096 1341.4411 1349.4972 1360.3706 1368.4519 1389.6786 1408.3853 1439.3238 1454.2491 1459.3197 1466.7765 1469.7211 1472.8680 1478.4170 1487.7352 1613.3333 1644.2101 1654.2038 1667.3281 1723.9207 2883.4683 2971.4166 2977.8805 2988.2630 3000.3312 3011.4395 3025.8433 3055.2776 3055.9310 3065.0746 3075.1983 3079.6651 3084.8367 3097.7425 3101.4094 3101.9330 3460.8827 3507.8573 3512.7496 3540.7921 3626.1182
redmass: 7.0370 7.9897 6.9196 6.4065 7.5344 5.2162 5.5365 9.1950 5.9218 6.8165 7.5818 5.6528 5.6162 4.6304 3.6484 2.8982 3.4104 3.6704 1.2118 2.4194 3.7879 3.3259 1.2636 3.4151 2.8222 2.8416 3.1071 4.8095 1.4208 3.2637 4.1407 4.4008 3.9770 4.7060 4.8841 4.0119 3.4036 4.5719 3.1669 1.2347 3.0156 1.2233 1.6379 2.5565 1.5901 3.2665 4.3875 3.8389 5.2173 2.6899 4.1034 3.0793 3.9861 3.7917 2.8870 4.4258 3.8677 2.4498 1.4915 3.7902 2.8823 3.1223 2.0789 1.6004 2.6377 2.5668 2.2638 2.2645 2.2621 1.6453 1.7983 1.4909 1.3748 1.4251 2.4434 1.8854 2.4508 1.2579 1.3417 1.9948 1.7807 1.5905 1.7364 1.4904 1.7685 3.3462 1.1979 1.5340 1.3376 1.7547 1.5954 1.9326 1.4321 1.1952 1.1888 1.1101 1.0491 1.0914 1.0497 1.0891 1.0533 1.8316 1.0497 4.5735 8.4703 1.1459 9.0174 12.7317 1.0803 1.0597 1.0386 1.0362 1.0649 1.0629 1.0940 1.1017 1.0838 1.0857 1.0965 1.1026 1.0990 1.1004 1.0962 1.0935 1.0510 1.0641 1.0640 1.0778 1.0959
irintensity: 0.0238 1.7269 0.2231 4.8254 1.1048 1.9367 0.0152 1.4671 5.2079 5.5782 3.9962 0.9066 1.3506 0.7947 3.2414 3.1204 0.6319 1.5979 0.2425 0.1131 0.5095 4.9426 1.8295 2.6420 24.4299 1.1443 24.3394 11.0142 41.0475 2.5315 2.5123 11.8253 4.7272 6.5936 25.5463 40.5586 21.3779 33.9215 22.8381 246.2751 50.4671 70.4003 69.1692 33.8426 95.6858 62.5537 41.9481 10.8435 10.9691 28.7790 4.2217 2.4047 4.8419 7.6483 24.2108 11.6453 13.5543 11.7427 3.1343 8.6576 5.1218 5.0481 62.7098 5.0628 31.2712 56.2523 288.8199 195.9277 12.3007 36.3781 41.4568 38.9859 10.2881 15.6365 2.8625 13.8815 15.4390 2.6645 18.8119 13.2531 121.2836 36.0453 45.0914 9.1573 22.6052 185.7932 4.7733 7.7535 4.1967 6.0048 29.8250 20.2117 1.6766 21.2686 13.4669 41.0038 5.9690 19.5396 7.4223 24.3099 13.0826 333.8626 23.3087 171.4730 163.0445 47.3444 178.1234 392.7836 65.6765 25.2865 19.1334 21.0914 9.2875 22.0419 29.5138 4.9497 37.0161 0.9746 18.0793 36.0081 15.1039 11.3973 24.9788 3.5208 133.3152 34.2968 21.4895 22.6490 68.9067
temp: 298.150 k
press: 1.00000 atm
elementType: 16 8 8 8 8 8 8 7 7 7 6 6 6 6 6 6 6 6 6 6 6 6 6 6 1 1 1 1 1 1 1 1 1 1 1 1 1 1 1 1 1 1 1 1 1
symmnumber: 1
zpe: 922358.2 jmol-1
zpe.correction: 0.351308 hartree
zpe.thermalcorrener: 0.377189 hartree
zpe.thermalcorrenthalpy: 0.378133 hartree
zpe.thermalcorrgfe: 0.291175 hartree
zpe.sumelectzpe: -1557.910788 hartree
zpe.sumelectthermal: -1557.884907 hartree
zpe.sumelectthermalent: -1557.883962 hartree
zpe.sumelectthermalfe: -1557.970921 hartree
dipole: -4.8872 -0.9331 -2.0999
dipole: 5.4005
quadrupole: -129.6556 -146.1946 -159.8476
quadrupole: 0.1529 -8.8538 3.5118
quadrupole: 15.5770 -0.9620 -14.6150 0.1529 -8.8538 3.5118
hfenergy: -1558.2620953 hartree
pointgroup: C01 [X(C14H21N3O6S1)]
dipole: -1.882687 -0.3789488 -0.9090216 debye
polarizability: 273.4908166|-6.7467566|184.3954038|-4.1358824|-3.6608877|168.2254329 unknown
InChI: InChI=1S/C14H21N3O6S/c1-14(2)9(13(22)23)17-10(19)8(11(17)24-14)16-7(18)5-3-4-6(15)12(20)21/h6,8-9,11,16,20,22H,3-5,15H2,1-2H3
charge 0 multiplicity 1
45 atoms
S  -2.70533 1.640738 -1.376571
O  -1.888635 -0.998355 2.320422
O  -6.441914 -1.011688 -0.293917
O  -4.772234 -1.429217 -1.85926
O  1.861577 0.700106 -0.306172
O  7.078172 1.614805 -0.53852
O  7.371762 -0.611825 0.035555
N  -2.886411 -0.5891 0.134411
N  0.327865 -1.036613 -0.192288
N  4.631839 1.818405 0.675459
C  -1.997909 -0.071131 -0.93305
C  -4.221085 1.440633 -0.159823
C  -4.264262 -0.115723 0.186464
C  -0.793137 -0.168427 0.086875
C  -1.866885 -0.665717 1.122959
C  -5.480359 1.958721 -0.878602
C  -3.934588 2.236997 1.131213
C  -5.133992 -0.919057 -0.780325
C  1.620476 -0.544118 -0.356996
C  2.695041 -1.607295 -0.619744
C  4.118488 -1.021917 -0.533857
C  4.54274 -0.645281 0.912655
C  5.42383 0.631665 0.97827
C  6.690553 0.435664 0.11937
H  -1.941592 -0.681195 -1.84495
H  -4.663019 -0.240009 1.207534
H  -0.396097 0.829892 0.340224
H  -5.387624 3.042177 -1.068826
H  -6.374551 1.79725 -0.248504
H  -5.632365 1.457439 -1.849356
H  -3.071418 1.826187 1.683283
H  -4.817954 2.216734 1.799235
H  -3.706633 3.288757 0.889385
H  0.179674 -2.047866 -0.211186
H  2.519015 -2.027371 -1.631257
H  2.571316 -2.445575 0.095446
H  -7.007198 -1.516683 -0.940307
H  4.837223 -1.749857 -0.951542
H  4.156263 -0.123585 -1.178384
H  5.08753 -1.485459 1.377349
H  3.654579 -0.436161 1.537409
H  5.832412 0.689108 2.016028
H  3.716278 1.642931 0.248174
H  5.143984 2.621182 0.311201
H  7.925674 1.445731 -1.033083
