program: Gaussian 09
title: 000270616
version: EM64L-G09RevD.01
frameworkgroup: C1[X(C9H13N2OP)]
method: RPBEPBE
basis: SDD
operation: Freq
keyword: #p
keyword: freq=noraman
keyword: PBEPBE/SDD
title: #p freq=noraman PBEPBE/SDD
converged: YES YES NO NO
title: Mulliken charges:
elementType: P O N N C C C C C C C C C H H H H H H H H H H H H H
charge: 1.227545 -0.591459 -0.862655 -0.859566 0.378509 -0.605430 0.351783 -0.509553 -0.351094 -0.643956 0.512128 -0.443680 -0.817973 0.252240 0.256791 0.326451 0.325165 0.227724 0.223389 0.228092 0.256499 0.217584 0.226501 0.223236 0.225919 0.225811
chargesum: 0.00000
title: Mulliken charges with hydrogens summed into heavy atoms:
elementType: P O N N C C C C C C C C C
charge: 1.227545 -0.591459 -0.536204 -0.534402 0.378509 -0.096399 0.351783 -0.281829 -0.127706 0.058219 0.512128 -0.217179 -0.143007
polarizability: 2.02953922e+02 2.16264145e+00 1.23740157e+02 5.91674118e+00 -6.71145966e+00 8.86784403e+01
1716.lowfreq: -14.3042 -3.7185 -0.0013 0.0013 0.0013 9.1088 34.4529 60.7401 67.3192
frequency: 34.2921 60.6247 67.2173 99.5438 163.2194 177.8967 195.6892 231.5419 243.8074 265.2005 309.5161 321.8472 358.5989 409.4053 425.1433 436.7369 443.5736 464.0732 532.7580 593.8388 603.6517 661.1742 731.7055 748.7582 751.1106 769.1444 784.8969 801.0262 821.3573 865.3284 920.6943 938.2140 978.9216 1000.8330 1009.3092 1041.4458 1046.8196 1054.3362 1131.1597 1157.2372 1212.5668 1237.1732 1241.9383 1264.4492 1274.8030 1310.0967 1318.1149 1395.2067 1395.5492 1411.6130 1424.0267 1463.0693 1471.1723 1478.1942 1480.5575 1482.7171 1504.3355 1607.6793 1628.7105 2970.9551 2988.3045 3017.2219 3046.3409 3077.1755 3080.9347 3087.9832 3104.3641 3124.8991 3127.4636 3150.8031 3608.4192 3609.1964
redmass: 2.7937 3.6506 1.0812 2.9982 2.9364 3.4165 2.7013 2.1840 2.3535 2.6766 4.0755 4.3285 2.4854 3.4796 2.1746 2.9019 1.6155 2.3343 4.9723 3.5693 5.8977 5.9938 5.4892 3.3385 1.3772 4.9674 3.7602 1.3945 3.9242 1.4775 1.3606 2.9812 1.8244 1.4764 1.9603 2.3959 1.5227 2.2940 1.5618 2.1194 1.4508 1.4454 1.4161 1.3770 1.6537 2.5357 1.7326 1.1972 1.2792 2.6749 1.0813 4.0129 1.0481 1.0413 1.1706 1.0499 3.4819 6.4082 7.3399 1.0373 1.0355 1.0594 1.0977 1.0997 1.0982 1.1016 1.1026 1.0912 1.0880 1.0968 1.0775 1.0791
irintensity: 0.2431 1.9678 0.4055 1.0974 5.4881 4.7906 3.9225 4.7195 9.3745 1.7028 14.5013 2.1318 10.1538 13.3771 63.3363 18.3325 24.6998 159.9511 11.1127 8.6442 16.6134 48.5730 14.3172 0.3858 9.2612 61.6052 26.7013 72.4272 110.6570 15.7027 1.7365 13.0771 37.8549 2.5274 29.8417 20.3226 12.4375 79.4062 14.7509 1.4140 0.4411 2.0223 1.8522 1.4648 47.9599 320.6063 134.9246 13.2334 6.0271 8.8806 7.2337 41.3938 12.5463 16.8326 40.9008 10.0182 203.4868 4.5887 6.9263 57.5935 30.5949 9.0952 25.5879 14.4971 20.5662 14.8543 22.1080 14.8913 16.2661 18.1387 80.3547 12.5149
temp: 298.150 k
press: 1.00000 atm
elementType: 15 8 7 7 6 6 6 6 6 6 6 6 6 1 1 1 1 1 1 1 1 1 1 1 1 1
symmnumber: 1
zpe: 545782.3 jmol-1
zpe.correction: 0.207878 hartree
zpe.thermalcorrener: 0.221544 hartree
zpe.thermalcorrenthalpy: 0.222489 hartree
zpe.thermalcorrgfe: 0.167248 hartree
zpe.sumelectzpe: -875.747266 hartree
zpe.sumelectthermal: -875.733599 hartree
zpe.sumelectthermalent: -875.732655 hartree
zpe.sumelectthermalfe: -875.787896 hartree
dipole: -0.4496 -1.0303 -3.1889
dipole: 3.3813
quadrupole: -83.4444 -72.9389 -94.4950
quadrupole: -1.8745 -11.3246 -5.5590
quadrupole: 0.1817 10.6871 -10.8689 -1.8745 -11.3246 -5.5590
hfenergy: -875.9551437 hartree
pointgroup: C01 [X(C9H13N2O1P1)]
dipole: 0.2262377 -0.5076946 1.2086185 debye
dipolederiv: 2.761893 0.0915596 -0.0441045 0.0690922 1.0165782 -0.1233413 -0.0651218 -0.175818 1.3470012 -1.0331113 -0.017134 -0.0113854 0.0178702 -0.5300182 0.0756307 -0.132952 0.0937023 -0.7151329 -1.7158597 -0.1307324 -0.0143539 -0.2041945 -0.5354663 0.0780021 0.0457485 0.1381585 -0.5460263 -1.7542993 0.0640774 0.0713891 0.0741832 -0.4542949 0.0014094 0.1549885 -0.0365485 -0.6337482 0.9716233 0.2701735 0.1007296 0.9816752 0.0691484 0.0212565 0.3788131 0.0242877 0.0767217 -0.1766901 -0.0283111 -0.0184326 -0.0376707 -0.0479649 0.03089 -0.0330722 0.0110803 -0.1664745 0.9997123 -0.271425 -0.0723823 -0.9924809 -0.0143031 -0.0294665 -0.2721907 -0.0340207 0.012631 -0.2065237 -0.0434382 -0.0100498 0.0151433 0.0516268 0.0906989 0.0011149 0.0837419 -0.2019084 -0.0283283 0.1060147 0.0433164 -0.0104285 0.0782267 0.0830697 -0.0034777 0.0944281 -0.1516917 -0.0343228 -0.0601563 -0.0213322 -0.0114246 0.0340935 -0.0274304 0.1447529 0.0606905 -0.0216678 0.1273334 -0.0467211 -0.0031197 -0.2674135 0.089789 0.0272347 -0.0677813 0.0256649 -0.0312189 -0.1855543 -0.0370005 -0.0031451 0.2189641 -0.0706514 0.0557198 0.0683561 0.0492449 -0.1839785 -0.0016118 0.0511637 0.0121742 0.1018485 0.025642 -0.0139882 0.0129166 -0.0090419 0.0811074 -0.0173627 -0.0195897 -0.0648632 -0.0046337 0.0524247 0.0460617 -0.0991918 0.0307791 -0.0485195 0.0068641 0.0507425 0.0437913 0.0280789 -0.0698752 -0.0450005 0.0662683 -0.0304571 0.0619321 0.1117548 0.0397919 -0.0069689 0.0636469 0.2148936 -0.0647999 -0.0768183 -0.0828873 0.3032688 0.1061254 -0.037882 -0.0303784 -0.012121 0.1822175 -0.0293052 -0.0901984 -0.0096346 0.3478962 0.0896212 -0.0124327 -0.0081127 0.0032735 -0.0871459 -0.0829987 0.0032271 -0.080506 0.1354976 0.0834135 0.0407425 0.0082403 0.0166803 -0.0927213 -0.0813142 0.0066029 -0.0841982 0.1395244 -0.0450994 -0.073995 0.1263178 -0.1027439 0.0599924 0.0407572 0.1375873 0.0425857 -0.0397624 0.0604724 0.011038 -0.0768017 0.056163 0.08568 0.0396814 -0.1437495 0.0051938 0.0000583 0.0399783 0.1304528 0.0197291 0.0669119 -0.0807333 -0.0440043 0.0021335 -0.0662311 0.0910052 -0.1072444 -0.0892339 -0.0413327 -0.0723937 0.0549625 -0.0392817 -0.0369857 -0.0403705 0.1465242 -0.0788334 -0.0519925 -0.0181786 -0.1680199 -0.0055042 -0.0353771 -0.0525995 -0.0345721 0.0950017 0.0112027 0.0296849 0.0176782 0.1049589 -0.0801332 0.1128408 -0.0464889 0.129853 0.014693 0.0148466 0.0346031 0.0015754 0.0650345 0.0535366 -0.0869449 0.098118 -0.1051247 -0.1127339 unknown
polarizability: 203.2552669|-1.6152132|122.3319547|1.4252231|9.6631561|89.7852984 unknown
InChI: InChI=1S/C9H13N2OP/c1-3-13(12)10-8-5-4-7(2)6-9(8)11-13/h4-6,10-11H,3H2,1-2H3
charge 0 multiplicity 1
26 atoms
P  -2.074569 0.248578 -0.218758
O  -2.989198 0.614269 -1.480901
N  -0.783866 -0.95266 -0.418364
N  -0.85309 1.400209 0.347584
C  0.517643 -0.442768 -0.183427
C  -3.11031 -0.250715 1.273837
C  0.477724 0.917868 0.257675
C  1.744878 -1.107259 -0.34769
C  1.672946 1.603411 0.53115
C  -4.078735 -1.401853 0.935939
C  2.961678 -0.424944 -0.063489
C  2.907182 0.920832 0.371698
C  4.292154 -1.14206 -0.226858
H  -2.400464 -0.51684 2.07534
H  -3.664731 0.654472 1.582948
H  -0.926651 -1.833468 -0.908891
H  -1.05021 2.390707 0.477564
H  1.76861 -2.148546 -0.691927
H  1.656213 2.647508 0.862791
H  -4.737252 -1.609417 1.798053
H  -4.711703 -1.14106 0.070033
H  -3.53363 -2.334139 0.700578
H  3.8409 1.451521 0.590137
H  5.138809 -0.466698 -0.014697
H  4.374893 -2.007377 0.458619
H  4.421382 -1.529071 -1.255542
