program: Gaussian 09
title: 000270609
version: EM64L-G09RevD.01
frameworkgroup: C1[X(C5H5N3O4)]
method: RPBEPBE
basis: SDD
operation: Freq
keyword: #pfreq=noraman
keyword: PBEPBE/SDD
title: #p freq=noraman PBEPBE/SDD
converged: YES YES NO NO
title: Mulliken charges:
elementType: O O O O N N N C C C C C H H H H H
charge: -0.410167 -0.155584 -0.192648 -0.231323 -0.143137 -0.017606 0.034668 0.326068 0.114461 -0.352685 -0.593819 0.146084 0.299275 0.260771 0.250506 0.272911 0.392225
chargesum: 0.00000
title: Mulliken charges with hydrogens summed into heavy atoms:
elementType: O O O O N N N C C C C C
charge: -0.017942 -0.155584 -0.192648 -0.231323 -0.143137 -0.017606 0.034668 0.326068 0.114461 -0.053410 0.190370 0.146084
polarizability: 1.21189813e+02 -2.48331570e+00 1.06418425e+02 7.31255129e+00 -3.18730811e-01 4.83271209e+01
1716.lowfreq: -9.4419 -6.5689 -0.0008 -0.0005 0.0004 4.6477 38.5662 72.2566 89.2182
frequency: 38.5572 72.2483 89.1998 106.5866 151.3730 185.9101 213.1782 255.1011 328.3555 366.0992 388.0590 457.1513 552.0170 562.1311 617.5602 632.5829 638.3366 698.8141 746.2234 747.9628 769.7453 871.9893 954.4163 1001.3893 1063.1580 1121.4342 1124.9069 1163.2270 1229.6964 1243.6950 1260.0461 1352.4899 1370.4161 1387.6420 1408.4874 1452.3814 1462.0716 1474.7855 1536.5510 1648.1423 3023.0359 3119.6379 3152.8427 3245.4183 3529.0000
redmass: 13.0508 6.8057 1.3389 2.4611 9.1005 8.9553 5.4055 4.4575 5.7317 5.9786 8.4107 7.2801 2.3967 2.3855 6.2095 3.0640 5.0078 8.7187 10.1302 6.2436 7.2344 1.4193 3.1890 6.0525 2.6060 2.4971 1.6219 1.5404 5.3982 3.1731 3.2699 4.2637 11.7269 3.2157 7.7628 1.5180 1.0414 1.0821 8.0371 9.2181 1.0337 1.1016 1.1030 1.0992 1.0644
irintensity: 2.8984 1.2486 1.7556 1.8515 2.2539 0.2596 1.6812 2.8791 0.0747 12.2333 2.4124 8.6481 64.9617 50.2273 9.2703 26.6198 26.6359 29.2292 31.5318 11.8062 15.8469 21.6916 21.3445 101.9296 119.9683 30.2052 12.3232 33.6369 89.7809 32.8781 34.8408 35.6403 188.8994 53.5830 13.2815 31.9228 21.3009 17.2144 88.7178 294.0606 11.4494 8.0585 1.4285 1.9768 50.0543
temp: 298.150 k
press: 1.00000 atm
elementType: 8 8 8 8 7 7 7 6 6 6 6 6 1 1 1 1 1
symmnumber: 1
zpe: 291972.9 jmol-1
zpe.correction: 0.111207 hartree
zpe.thermalcorrener: 0.122245 hartree
zpe.thermalcorrenthalpy: 0.123189 hartree
zpe.thermalcorrgfe: 0.073177 hartree
zpe.sumelectzpe: -657.685662 hartree
zpe.sumelectthermal: -657.674624 hartree
zpe.sumelectthermalent: -657.673679 hartree
zpe.sumelectthermalfe: -657.723691 hartree
dipole: -1.6645 -1.1893 -0.5357
dipole: 2.1147
quadrupole: -61.5178 -76.6635 -68.7825
quadrupole: 8.7358 -5.0339 -0.0865
quadrupole: 7.4701 -7.6756 0.2054 8.7358 -5.0339 -0.0865
hfenergy: -657.7968687 hartree
pointgroup: C01 [X(C5H5N3O4)]
dipole: 0.6746735 -0.4701431 0.1264533 debye
dipolederiv: -0.4072706 0.1672684 0.1684546 0.2494031 -0.7705084 -0.3636885 0.278261 -0.350902 -0.6687666 -0.3583349 0.1616771 -0.1653405 0.1546229 -0.6738579 0.0882455 -0.2122397 0.0725787 -0.3448322 -0.5669347 -0.1151593 -0.2890058 -0.1186124 -0.520904 -0.1034896 -0.2818958 -0.0396282 -0.4413386 -1.0052918 -0.2035843 -0.2243513 -0.0863244 -0.5183345 -0.2017703 -0.08343 -0.1728087 -0.5035471 -0.595158 -0.1864408 -0.0720416 0.0563283 0.1634066 0.0403481 -0.0549727 -0.0981353 -0.0730946 -0.2499874 -0.0876761 0.0018346 0.1173459 -0.3365933 -0.0093832 0.0744854 0.0254607 -0.1864919 0.7233648 0.0073012 0.5517751 0.1076323 1.5052989 0.1017823 0.5373728 0.075572 0.6722572 0.5614303 -0.0825895 -0.0996776 -0.1703062 -0.6007295 -0.148149 0.0386361 -0.1365644 0.0022288 -0.7056386 0.1796385 0.0412148 0.1131161 -0.0026343 -0.0408935 -0.0193422 0.1009724 -0.0077564 0.046514 0.1808811 0.0374802 -0.0414034 0.1242575 0.0591615 -0.0750543 0.0354485 -0.0560544 0.4194731 0.0227916 0.0150003 0.0215712 0.1260443 -0.0106973 -0.0003911 -0.014357 0.1681706 1.7651937 -0.0257325 0.0876966 -0.3147954 0.9337696 0.6334158 -0.0897957 0.5365384 0.7762372 0.0921259 -0.0190386 -0.0081217 -0.0270816 0.0946673 -0.0218069 0.0042251 -0.0487022 0.1669963 0.07923 0.0062602 0.0044511 0.0987185 0.0093638 -0.0497797 0.041478 -0.0501381 0.1196239 0.0282547 0.009112 -0.012468 -0.0622903 -0.002607 0.0970895 0.0086774 0.0830093 0.0400782 0.0262753 -0.0024375 0.0140338 -0.0507589 0.1206454 -0.0374102 -0.0498222 -0.0087394 -0.0349243 0.1467542 -0.0122715 -0.0509347 -0.0471656 0.3487158 -0.0329745 -0.1161922 -0.0096048 0.3712139 unknown
polarizability: 119.707326|0.311296|102.111515|11.7893986|15.8661533|54.1165173 unknown
InChI: InChI=1S/C5H5N3O4/c1-7-4(8(11)12)3(2-6-7)5(9)10/h2,9H,1H3
charge 0 multiplicity 1
17 atoms
O  -2.385471 0.764607 0.741712
O  -0.130753 2.27876 -0.181292
O  1.608726 1.700984 1.192908
O  -3.120928 -0.947359 -0.656169
N  1.490349 -0.856322 -0.090792
N  1.054957 -2.122117 -0.468185
N  0.633846 1.414462 0.383694
C  0.423845 0.009667 0.076021
C  -0.76307 -0.712908 -0.188951
C  -0.307397 -2.022845 -0.518132
C  2.935389 -0.609822 0.038479
C  -2.183655 -0.331942 -0.095223
H  -0.915783 -2.887241 -0.774124
H  3.439841 -1.515605 -0.32591
H  3.237693 0.259751 -0.567345
H  3.198005 -0.415132 1.089105
H  -3.350894 1.005263 0.753003
