program: Gaussian 09
title: 000270608
version: EM64L-G09RevD.01
frameworkgroup: C1[X(C10H11ClO2)]
method: RPBEPBE
basis: SDD
operation: Freq
keyword: #p
keyword: freq=noraman
keyword: PBEPBE/SDD
title: #p freq=noraman PBEPBE/SDD
converged: YES YES NO NO
title: Mulliken charges:
elementType: Cl O O C C C C C C C C C C H H H H H H H H H H H
charge: -0.055391 -0.309783 -0.300574 -0.035329 -0.357642 -0.277335 0.318851 0.358726 -0.265756 -0.401322 -0.810568 -0.251711 -0.225980 0.228271 0.249099 0.223480 0.227524 0.228407 0.238717 0.285588 0.214681 0.230175 0.255491 0.232381
chargesum: 0.00000
title: Mulliken charges with hydrogens summed into heavy atoms:
elementType: Cl O O C C C C C C C C C C
charge: -0.055391 -0.309783 -0.300574 0.192943 0.114938 0.178596 0.318851 0.358726 -0.265756 -0.162605 -0.080124 0.003780 0.006400
polarizability: 1.46721967e+02 -3.86768601e+00 1.41510201e+02 1.17761752e+01 1.29217444e+00 7.03299678e+01
1716.lowfreq: -8.9885 -0.6270 0.0006 0.0011 0.0021 8.1655 31.3053 66.5226 83.6167
frequency: 31.1656 66.4476 83.6098 114.6304 156.9444 169.3362 171.1168 214.6009 238.5373 285.1010 326.7141 338.9981 373.1688 461.2656 496.5956 508.1149 548.7460 554.7778 635.6897 691.4767 727.4115 772.1771 788.8169 794.0657 837.7166 888.1444 893.1814 917.7817 967.1628 984.8339 996.5716 1043.4873 1048.7641 1052.9616 1080.3329 1106.1350 1123.6389 1127.2151 1175.1362 1201.2522 1226.2077 1244.0507 1261.7136 1351.5960 1362.6501 1387.1068 1407.9094 1421.0406 1448.1892 1457.5651 1463.8877 1466.5963 1486.8437 1569.3538 1599.9300 2974.9981 2987.2540 3051.1469 3054.6808 3077.6118 3086.8900 3089.2504 3133.0735 3153.5773 3174.3151 3196.3158
redmass: 4.1814 5.5364 4.1512 3.1057 5.8613 1.1401 4.1635 3.3087 5.6451 4.0219 4.1622 2.7722 6.8085 4.8188 4.3350 3.9858 4.7510 3.6306 5.7572 5.2991 4.6400 1.2734 4.6950 4.3231 5.5245 2.5823 1.3332 2.5635 1.3273 1.4219 1.5952 1.6806 1.6212 1.6068 1.7940 1.3357 1.5343 2.2293 1.3296 1.6115 1.4823 1.3666 2.1387 1.5742 7.2459 1.8755 1.2422 2.2873 1.7191 1.3902 1.1151 1.2756 1.1434 6.2845 6.7363 1.0372 1.0563 1.1066 1.0974 1.0630 1.0793 1.0999 1.0875 1.0923 1.0985 1.1190
irintensity: 2.3551 5.4687 1.2962 5.4891 0.7057 1.8217 7.2996 1.6226 0.1469 4.3517 5.6933 14.1060 5.2248 0.3649 5.8479 1.3520 2.5632 0.7498 8.6156 13.9479 7.2193 62.5200 38.0449 8.5532 26.0711 3.4004 0.0301 66.9329 0.8137 11.9894 4.5256 7.6862 7.6180 3.1364 37.0886 4.7158 4.4706 33.4837 14.6525 32.2648 58.9065 2.2971 39.5332 4.9066 0.4147 4.4439 15.5890 53.1210 42.3348 2.1746 14.8728 6.6562 45.0967 11.0575 4.8539 22.4425 29.2164 17.1317 17.1034 25.7568 43.6889 14.1610 7.0418 13.5194 10.5837 19.7483
temp: 298.150 k
press: 1.00000 atm
elementType: 17 8 8 6 6 6 6 6 6 6 6 6 6 1 1 1 1 1 1 1 1 1 1 1
symmnumber: 1
zpe: 485250.7 jmol-1
zpe.correction: 0.184822 hartree
zpe.thermalcorrener: 0.197605 hartree
zpe.thermalcorrenthalpy: 0.198549 hartree
zpe.thermalcorrgfe: 0.144651 hartree
zpe.sumelectzpe: -997.136927 hartree
zpe.sumelectthermal: -997.124144 hartree
zpe.sumelectthermalent: -997.123200 hartree
zpe.sumelectthermalfe: -997.177098 hartree
dipole: 0.1868 -0.2147 -0.0493
dipole: 0.2888
quadrupole: -74.7666 -79.2221 -86.2676
quadrupole: -9.7993 5.9816 3.7309
quadrupole: 5.3189 0.8633 -6.1822 -9.7993 5.9816 3.7309
hfenergy: -997.3217491 hartree
pointgroup: C01 [X(C10H11Cl1O2)]
dipole: 0.0883 0.0690427 0.0186559 debye
dipolederiv: -0.1841402 -0.1529646 0.027634 -0.1260948 -0.7232627 0.0675841 0.0160112 0.0598249 -0.0737849 -0.5254273 -0.0129761 -0.0002907 0.0214146 -0.5310985 0.1504408 -0.0081429 0.1954118 -0.42347 -1.4344725 -0.2381066 -0.0459112 -0.4913021 -0.4198976 0.024032 -0.0014401 0.0008947 -0.3144276 0.3094625 -0.002951 0.0550276 -0.069803 0.2882572 0.0342617 0.0596681 -0.0852056 0.179217 0.3267191 0.0123646 -0.0048225 0.0765124 0.078368 -0.0973405 -0.0486213 0.0071264 0.2019524 0.6232856 0.1273412 0.0785433 0.4363185 0.3458541 0.0230977 0.390899 0.0458562 0.3279402 1.093401 0.1186396 -0.0510972 0.3603168 -0.1208202 -0.0711574 -0.3029985 -0.0528268 0.0294648 0.0159539 -0.1346981 -0.059709 -0.3456048 0.1575854 0.0721492 -0.0779572 0.0523775 0.004148 0.0372218 0.2137939 -0.0733161 0.2174493 0.9667036 -0.1088907 0.0170125 -0.0757606 -0.0595423 -0.0704935 0.1239613 -0.0149885 0.0434884 0.047006 -0.0135998 -0.0196523 -0.0358649 -0.1687441 -0.1564285 0.1236779 -0.0027468 0.093633 0.0004605 -0.0434707 0.0125212 -0.0672332 0.0317876 -0.0992696 -0.0580704 -0.0100272 -0.0842476 -0.2162386 0.0268144 -0.0020277 0.0165025 -0.1209629 0.0329182 -0.0261936 -0.0535882 0.0599119 0.0310597 -0.0133775 -0.0475334 0.0062751 -0.1414444 -0.0836803 -0.0680128 -0.0692855 -0.0342205 -0.0429035 -0.0680637 -0.0962562 -0.070361 0.0556904 0.0802761 -0.0366196 -0.0782491 -0.0440905 0.1036204 -0.0302032 -0.0552934 -0.0274556 -0.0413804 -0.1628223 0.0184208 0.0779697 0.0159469 0.108811 0.0059574 0.0481436 -0.0090996 0.0285361 0.0257262 -0.005122 -0.0175029 -0.1072109 -0.1222291 0.0074139 -0.0406622 0.0476567 0.0540173 -0.0297444 0.0350814 0.0868206 -0.0547483 0.0608313 0.0106708 -0.0125515 -0.0313185 -0.0862142 0.0742742 -0.0302327 0.0125329 -0.0646245 -0.1044041 0.0123972 0.025788 0.0082598 0.1511656 0.0824451 0.0489267 -0.0456903 0.0445373 0.0918272 -0.0370874 -0.0466025 -0.0018765 0.05919 0.0247385 -0.1253474 0.038286 -0.0384429 -0.1214875 0.0366342 0.0241211 0.066702 0.0927251 0.0831321 0.0468606 0.0675407 0.0539081 0.0491176 0.0158253 0.0787826 -0.0444939 -0.0990093 0.0343752 0.0622257 0.0257964 0.0806642 0.0117528 -0.0151657 0.0253314 -0.0135198 0.1633219 -0.0974508 -0.0399988 0.0570739 -0.0437115 0.0610869 0.0110778 0.0614603 0.0081285 0.1498237 unknown
polarizability: 147.8655434|2.5816883|140.2849751|-11.7022105|3.1849874|70.4116174 unknown
InChI: InChI=1S/C10H11ClO2/c1-7-3-2-4-9(11)10(7)13-6-8-5-12-8/h2-4,8H,5-6H2,1H3
charge 0 multiplicity 1
24 atoms
Cl -1.0635 2.826221 -0.214379
O  3.024421 -1.07536 0.76449
O  0.743371 0.320771 -0.596113
C  2.960403 0.396104 0.435704
C  3.43913 -0.566227 -0.603839
C  1.590949 1.042485 0.379305
C  -0.590618 0.052228 -0.232037
C  -0.990049 -1.313824 -0.142982
C  -1.551457 1.072781 -0.031723
C  -2.344138 -1.599771 0.158701
C  0.025738 -2.41352 -0.375451
C  -2.893627 0.783169 0.275368
C  -3.287338 -0.569606 0.371969
H  3.706747 0.994287 0.979461
H  2.748517 -0.839092 -1.408233
H  4.511789 -0.646337 -0.815935
H  1.692355 2.095225 0.052939
H  1.116415 1.024868 1.379441
H  -2.656709 -2.64738 0.233234
H  0.954864 -2.228233 0.193901
H  -0.387029 -3.395114 -0.086811
H  0.313054 -2.4641 -1.442955
H  -3.610175 1.596149 0.423035
H  -4.328208 -0.813025 0.608508
