program: Gaussian 09
title: 000270593
version: EM64L-G09RevD.01
frameworkgroup: C1[X(C22H20N2O2)]
method: RPBEPBE
basis: SDD
operation: Freq
keyword: #p
keyword: freq=noraman
keyword: PBEPBE/SDD
title: #p freq=noraman PBEPBE/SDD
converged: YES YES NO NO
title: Mulliken charges:
elementType: O O N N C C C C C C C C C C C C C C C C C C C C C C H H H H H H H H H H H H H H H H H H H H
charge: -0.283425 -0.250535 -0.453763 -0.468017 -0.018744 0.354451 0.350755 0.543955 -0.578417 -0.706920 0.286553 0.287455 -0.402410 -0.401411 -0.401285 -0.411176 0.252228 -0.234118 -0.251178 -0.249769 -0.233905 -0.242553 -0.242256 0.218421 -0.789259 -0.782399 0.333997 0.247510 0.304089 0.248777 0.290926 0.300317 0.243780 0.307562 0.226486 0.230974 0.232277 0.225623 0.228457 0.229312 0.254061 0.254246 0.216037 0.260297 0.259502 0.213491
chargesum: 0.00000
title: Mulliken charges with hydrogens summed into heavy atoms:
elementType: O O N N C C C C C C C C C C C C C C C C C C C C C C
charge: -0.283425 -0.250535 -0.149674 -0.160455 -0.018744 0.354451 0.350755 0.543955 -0.244420 -0.459410 0.286553 0.287455 -0.153633 -0.110485 -0.100969 -0.167396 0.252228 -0.007632 -0.020204 -0.017492 -0.008283 -0.014096 -0.012944 0.218421 -0.064916 -0.049108
polarizability: 3.38407188e+02 -8.37188684e+00 3.06242666e+02 1.27659960e+01 1.78532418e+01 1.64471912e+02
1716.lowfreq: -44.0609 -5.8245 -3.1519 -0.0006 -0.0004 0.0001 2.7890 27.7065 39.2188
frequency: -44.0604 27.6823 39.2109 42.9004 50.3838 53.8583 56.5022 62.0381 76.0968 78.3086 92.0824 116.1156 123.1856 154.2970 183.4775 227.4016 235.4498 247.4407 270.8882 276.8561 300.0878 304.9070 377.2011 383.2873 408.5582 410.3148 425.0334 442.0230 495.5042 509.0951 531.0253 574.9422 578.5980 589.2913 605.5373 608.1699 614.3512 624.3872 631.3481 638.1148 648.0002 662.1083 700.9540 709.8187 713.0702 733.9471 773.9540 775.4125 810.8617 840.6939 861.2665 862.4640 878.8208 902.3805 927.9186 933.8617 937.4236 945.0886 949.3665 983.8402 984.4752 988.0708 988.2541 991.7167 994.9407 1001.7676 1005.2651 1027.4919 1028.2933 1038.9967 1040.1361 1055.7001 1082.3169 1084.1953 1155.5842 1172.3422 1172.7330 1189.0486 1195.0040 1196.6680 1211.7742 1242.2925 1261.4241 1268.6732 1318.5659 1319.2085 1342.9023 1362.1562 1371.1592 1372.5155 1383.9796 1388.2931 1397.5221 1424.3612 1434.5454 1445.1575 1449.0173 1456.7803 1460.8784 1469.7261 1471.0134 1480.7304 1490.8754 1512.4210 1579.8665 1581.7856 1589.6215 1602.3073 1611.6902 1612.6598 1617.7569 1627.4328 2995.0834 2995.5980 3090.2096 3094.6043 3102.1506 3108.2235 3117.1429 3119.9905 3122.0943 3127.9288 3129.1949 3139.9991 3141.2100 3150.1205 3150.3256 3162.9068 3163.4540 3191.0000 3518.6809 3533.7169
redmass: 1.0869 4.9965 2.5477 3.3635 1.9573 4.2842 2.8264 3.7847 4.0480 3.6506 5.5151 4.9128 5.3246 4.8283 5.9284 6.5981 6.0590 4.5313 4.1011 3.9478 3.7363 4.4796 4.7785 4.3002 2.9240 2.9297 5.3511 2.8100 3.7478 3.6772 1.5209 3.7077 3.2699 3.9083 4.5715 5.4959 6.1673 2.8412 3.3479 4.5929 6.0453 1.7312 4.5866 1.8706 1.8187 2.8965 2.0525 2.0453 6.1178 5.0109 1.2462 1.2565 1.6045 4.5704 1.4387 1.4802 4.9990 1.4961 4.7117 1.3613 1.3890 5.4676 5.3761 1.6454 1.8921 1.3071 1.3041 2.3895 2.2992 1.6627 1.6368 2.3594 1.6289 1.6201 2.9084 1.0544 1.0547 2.6956 1.1237 1.2570 2.2991 1.9114 1.6654 1.9624 1.4454 1.4235 4.2880 4.3332 5.5195 6.3504 1.2360 1.3433 2.8793 2.5107 2.3227 1.1216 1.0470 2.5394 1.3186 1.1154 1.6220 2.2644 2.6609 2.4808 5.9687 5.7885 6.6467 5.7466 5.9927 5.9936 6.3169 4.9404 1.0364 1.0363 1.0992 1.0995 1.0990 1.0992 1.0905 1.0860 1.0846 1.0878 1.0880 1.0928 1.0928 1.0964 1.0965 1.1017 1.1017 1.0927 1.0764 1.0765
irintensity: 0.6926 0.6352 0.0739 0.0898 4.9000 0.1619 8.1054 6.6960 10.4702 1.0507 4.9201 2.4065 4.4747 2.4560 3.7115 0.2930 2.6595 2.8767 0.1338 0.5752 0.3836 0.6218 0.0586 1.3528 0.0556 0.0813 8.4913 14.7168 2.4504 25.5705 73.9602 5.1186 3.5734 14.5291 6.1111 32.9620 1.5605 21.8131 14.6347 6.5660 2.8008 26.2497 7.8645 34.9154 56.4162 17.4466 90.3630 7.2458 5.9008 0.6016 3.6487 0.8768 25.2172 2.1741 16.2866 1.9282 5.5536 11.3391 8.2685 2.8799 0.7879 0.5715 0.0599 2.6163 22.5602 2.4950 3.5827 0.8554 16.6863 12.7831 14.2596 3.6963 2.4956 9.6771 8.6319 0.0332 0.0185 1.1776 5.9707 0.8562 19.3646 155.3136 48.6762 15.5731 4.8404 1.4330 19.1159 5.3074 0.8241 10.5547 87.6657 122.4696 112.2530 63.4816 6.5923 38.7346 15.3395 39.0500 95.1365 11.1309 68.5879 120.3304 0.2216 274.1803 17.0139 31.1138 75.3090 117.9272 2.7096 1.4624 120.0760 105.6271 10.3709 12.6443 13.9043 14.4586 10.6671 10.0252 11.1100 4.4749 1.2622 5.0844 6.0913 22.6702 21.6592 1.6341 24.4752 52.0780 22.9908 10.1085 15.8314 11.7242
temp: 298.150 k
press: 1.00000 atm
elementType: 8 8 7 7 6 6 6 6 6 6 6 6 6 6 6 6 6 6 6 6 6 6 6 6 6 6 1 1 1 1 1 1 1 1 1 1 1 1 1 1 1 1 1 1 1 1
symmnumber: 1
zpe: 955355.3 jmol-1
zpe.correction: 0.363876 hartree
zpe.thermalcorrener: 0.386971 hartree
zpe.thermalcorrenthalpy: 0.387915 hartree
zpe.thermalcorrgfe: 0.309230 hartree
zpe.sumelectzpe: -1108.520473 hartree
zpe.sumelectthermal: -1108.497378 hartree
zpe.sumelectthermalent: -1108.496433 hartree
zpe.sumelectthermalfe: -1108.575119 hartree
dipole: -2.1858 2.5831 3.2458
dipole: 4.6888
quadrupole: -153.1186 -117.7625 -154.1990
quadrupole: -0.6785 -3.0711 -5.7612
quadrupole: -11.4252 23.9308 -12.5056 -0.6785 -3.0711 -5.7612
hfenergy: -1108.8843486 hartree
pointgroup: C01 [X(C22H20N2O2)]
dipole: 1.0099406 -0.8133109 1.3120703 debye
polarizability: 338.6396159|-7.1575436|300.6430734|-17.244997|-30.4384633|169.8390759 unknown
InChI: InChI=1S/C22H20N2O2/c1-15(25)23-19-13-20(17-9-5-3-6-10-17)22(24-16(2)26)21(14-19)18-11-7-4-8-12-18/h3-14,23-24H,1-2H3
charge 0 multiplicity 1
46 atoms
O  1.28386 2.249038 -1.948252
O  -3.719901 -3.090907 0.258413
N  0.947021 1.695289 0.292969
N  -1.412388 -3.492436 0.079637
C  0.337045 0.393959 0.107964
C  -1.085423 0.274165 0.11294
C  1.156431 -0.775129 0.087576
C  -0.878067 -2.172622 0.098617
C  -1.684456 -1.009973 0.115983
C  0.532339 -2.043244 0.082774
C  -1.991382 1.466207 0.135999
C  2.652921 -0.725554 0.108509
C  -3.027916 1.550422 1.104234
C  -1.88122 2.495421 -0.83788
C  3.386713 -0.013543 -0.878073
C  3.367579 -1.455814 1.096753
C  1.368006 2.547543 -0.717362
C  -3.920259 2.645287 1.113915
C  -2.778408 3.5856 -0.830919
C  4.798856 -0.028565 -0.866591
C  4.780079 -1.465088 1.10984
C  -3.797571 3.669392 0.1467
C  5.502066 -0.749902 0.126629
C  -2.749533 -3.895829 0.148254
C  1.923363 3.886753 -0.242687
C  -2.961529 -5.406788 0.071421
H  -2.77074 -1.111422 0.110061
H  1.165876 -2.938558 0.04667
H  1.031946 2.026823 1.256803
H  -3.127638 0.757335 1.854456
H  -1.115823 2.421039 -1.617804
H  2.848087 0.528358 -1.662641
H  2.810993 -2.000298 1.869101
H  -0.720169 -4.240578 0.001543
H  -4.710206 2.695709 1.871724
H  -2.688727 4.362974 -1.598194
H  5.349202 0.517345 -1.641185
H  5.314194 -2.025456 1.885631
H  -4.492786 4.516536 0.149198
H  6.597902 -0.757872 0.132113
H  1.211571 4.686748 -0.514713
H  2.867975 4.090556 -0.773314
H  2.104775 3.931445 0.845147
H  -3.544358 -5.640108 -0.83678
H  -3.565496 -5.727058 0.937162
H  -2.026309 -5.993203 0.051359
