program: Gaussian 09
title: 000270589
version: EM64L-G09RevD.01
frameworkgroup: C1[X(C16H16O3)]
method: RPBEPBE
basis: SDD
operation: Freq
keyword: #pfreq=noraman
keyword: PBEPBE/SDD
title: #p freq=noraman PBEPBE/SDD
converged: YES YES NO NO
title: Mulliken charges:
elementType: O O O C C C C C C C C C C C C C C C C H H H H H H H H H H H H H H H H
charge: -0.265426 -0.419969 -0.228676 -0.368890 0.510009 -0.560917 0.457050 -0.437788 -0.384095 -0.395350 -0.417664 0.198890 -0.355567 -0.357844 0.313833 -0.235935 -0.251642 -0.243518 -0.538251 0.252255 0.265110 0.256258 0.239313 0.248579 0.236747 0.254389 0.249605 0.239004 0.225049 0.224677 0.227674 0.376331 0.245162 0.220406 0.221190
chargesum: 0.00000
title: Mulliken charges with hydrogens summed into heavy atoms:
elementType: O O O C C C C C C C C C C C C C C C C
charge: -0.265426 -0.043638 -0.228676 -0.116635 0.510009 -0.039548 0.457050 -0.198475 -0.135516 -0.158603 -0.163275 0.198890 -0.105962 -0.118840 0.313833 -0.010886 -0.026965 -0.015844 0.148507
polarizability: 2.25434817e+02 1.09367963e+01 1.62900923e+02 -9.96097071e+00 -1.13274694e+01 1.49022864e+02
1716.lowfreq: -4.8148 -1.4595 0.0005 0.0007 0.0008 4.8261 23.9004 29.3275 41.2645
frequency: 23.8170 29.2920 41.2574 45.3477 59.3272 62.2384 98.3369 152.0725 170.6705 190.2021 210.2062 237.0292 249.8487 285.4941 351.1960 368.2821 403.0035 414.2016 438.4055 455.9034 479.3256 518.9297 538.0154 564.5483 600.3878 607.1211 618.1807 636.7985 672.6769 703.7824 730.7089 735.0991 762.0723 789.8764 817.7670 824.2861 834.9779 853.2428 896.2667 924.2795 949.3152 958.7126 965.6880 977.2112 988.6556 990.7538 994.6183 1002.8000 1018.4625 1036.9500 1062.8800 1095.3591 1111.8439 1112.5047 1155.7910 1172.6153 1175.5903 1178.3690 1193.0674 1197.6471 1211.7131 1230.3530 1242.5040 1269.9615 1308.0430 1317.3105 1334.7241 1356.8684 1377.8136 1387.7100 1417.9496 1435.9944 1438.9335 1460.1818 1466.2915 1472.4501 1487.3122 1499.8197 1582.7215 1592.4761 1614.0575 1622.4845 1664.8268 2958.0544 2993.5846 3012.8039 3045.2079 3090.2440 3117.3534 3117.5856 3124.2975 3124.5989 3131.9986 3138.1792 3149.0051 3159.3657 3163.1885 3165.2840 3503.7980
redmass: 3.8165 3.6929 6.0280 7.3915 4.9120 5.7607 3.7300 4.8523 3.8738 4.0456 4.0745 1.2711 4.4170 3.8457 4.7805 3.6681 2.8048 2.9564 4.3383 3.2419 3.7970 2.8501 4.0414 2.6669 3.7517 2.6373 5.6056 5.7248 1.7468 1.9275 2.4530 3.7746 3.7520 2.8086 1.4260 3.3079 1.6534 1.2528 3.1700 1.5516 1.4490 2.1438 1.3531 1.4118 8.3312 5.4716 1.3394 2.7260 3.5967 2.2162 2.1300 1.7453 1.2761 1.3621 1.3502 1.0966 1.2028 1.2866 2.3587 1.1189 2.1100 3.3301 1.3609 1.7041 1.3205 1.4860 1.6031 1.4930 5.6469 4.5628 3.2957 1.1860 2.1098 1.1164 1.0501 1.0752 2.1773 2.4171 7.0238 5.9124 5.9849 6.3797 8.5413 1.0331 1.0829 1.0638 1.1039 1.0973 1.0884 1.0872 1.0989 1.0868 1.0885 1.0920 1.0949 1.0944 1.1012 1.0950 1.0638
irintensity: 0.5861 0.3401 1.1807 0.7346 0.3521 0.1444 4.9435 1.6985 5.0567 1.2104 0.1596 0.3421 1.0192 0.2948 1.6665 3.0614 0.2514 0.1964 4.4283 2.2999 0.5900 16.0751 41.8422 61.5132 8.0819 33.8861 4.4553 2.2131 118.7216 45.4537 21.3042 1.8237 26.2033 12.6856 24.1020 11.1508 36.8195 0.1865 1.8552 1.0098 1.5475 16.4233 0.3878 0.2540 38.8236 2.9833 0.1379 7.3486 58.9770 40.1708 176.4153 8.0984 2.2044 10.3366 0.2143 5.0604 14.9539 79.8406 1.7860 0.3101 12.8881 171.1783 2.9201 5.8957 9.1075 9.9630 39.7907 22.9925 3.4044 7.2603 1.0278 13.4666 6.4246 25.6753 13.4281 60.9603 15.2291 127.2117 12.2719 3.7399 7.3382 44.7597 204.7992 66.0300 5.2090 7.9033 48.8249 6.9227 9.5881 9.9252 30.0369 0.3822 6.2747 21.7158 34.5698 13.5588 22.0707 5.4534 19.7213
temp: 298.150 k
press: 1.00000 atm
elementType: 8 8 8 6 6 6 6 6 6 6 6 6 6 6 6 6 6 6 6 1 1 1 1 1 1 1 1 1 1 1 1 1 1 1 1
symmnumber: 1
zpe: 732834.5 jmol-1
zpe.correction: 0.279122 hartree
zpe.thermalcorrener: 0.296619 hartree
zpe.thermalcorrenthalpy: 0.297564 hartree
zpe.thermalcorrgfe: 0.230995 hartree
zpe.sumelectzpe: -843.601910 hartree
zpe.sumelectthermal: -843.584412 hartree
zpe.sumelectthermalent: -843.583468 hartree
zpe.sumelectthermalfe: -843.650036 hartree
dipole: -1.1357 1.4006 -2.3876
dipole: 2.9920
quadrupole: -101.8344 -106.1585 -108.9192
quadrupole: -3.1374 -1.0860 0.5050
quadrupole: 3.8030 -0.5212 -3.2818 -3.1374 -1.0860 0.5050
hfenergy: -843.8810315 hartree
pointgroup: C01 [X(C16H16O3)]
dipole: 0.4377597 -0.4332353 -1.0031683 debye
polarizability: 225.8583954|7.4381066|159.1194376|12.0075405|12.4448972|152.3807709 unknown
InChI: InChI=1S/C16H16O3/c1-19-14-9-7-13(8-10-14)15(11-16(17)18)12-5-3-2-4-6-12/h2-10,15,17H,11H2,1H3
charge 0 multiplicity 1
35 atoms
O  5.023526 0.068403 0.044846
O  -3.234122 2.755869 -1.075451
O  -3.046193 2.451791 1.218472
C  -0.712417 0.648753 0.531261
C  0.801622 0.427863 0.38423
C  -1.114883 1.942816 -0.237689
C  -1.52958 -0.589801 0.137199
C  1.696936 1.008004 1.322727
C  1.351043 -0.295741 -0.699422
C  -1.505937 -1.715943 1.001774
C  -2.286996 -0.677145 -1.057504
C  -2.529308 2.38571 0.082081
C  3.09002 0.873002 1.185646
C  2.748347 -0.442009 -0.856619
C  3.621888 0.147107 0.090482
C  -2.214582 -2.893542 0.686166
C  -2.998366 -1.857709 -1.379583
C  -2.965287 -2.970488 -0.511696
C  5.621205 -0.676205 -1.065408
H  -0.918216 0.853396 1.601137
H  -0.436196 2.755354 0.084835
H  -0.988616 1.832731 -1.326588
H  1.296058 1.567429 2.177692
H  0.681185 -0.771383 -1.425071
H  -0.921496 -1.664732 1.92893
H  -2.342581 0.17337 -1.745459
H  3.78274 1.312021 1.910126
H  3.136746 -1.013345 -1.705341
H  -2.185101 -3.748325 1.371401
H  -3.580713 -1.903035 -2.307107
H  -3.518672 -3.883118 -0.759954
H  -4.150591 3.050587 -0.81796
H  6.707087 -0.613071 -0.902304
H  5.363569 -0.220699 -2.041642
H  5.303777 -1.737314 -1.056911
