program: Gaussian 09
title: 000270587
version: EM64L-G09RevD.01
frameworkgroup: C1[X(C22H32N2O2)]
method: RPBEPBE
basis: SDD
operation: Freq
keyword: #p
keyword: freq=noraman
keyword: PBEPBE/SDD
title: #p freq=noraman PBEPBE/SDD
converged: YES YES NO NO
title: Mulliken charges:
elementType: O O N N C C C C C C C C C C C C C C C C C C C C C C H H H H H H H H H H H H H H H H H H H H H H H H H H H H H H H H
charge: -0.312703 -0.312699 -0.385533 -0.385538 -0.255265 -0.255239 -0.083997 -0.083988 -0.449945 -0.449947 -0.426953 -0.426959 -0.403054 -0.403059 -0.385651 -0.385651 0.571155 0.571145 -0.508440 -0.376816 -0.376821 -0.508444 0.285896 0.285875 -0.809843 -0.809861 0.193894 0.193886 0.259762 0.259757 0.197391 0.218364 0.218363 0.197390 0.221819 0.178199 0.221819 0.178199 0.204051 0.190172 0.204051 0.190173 0.197321 0.201651 0.197320 0.201649 0.280457 0.280454 0.221877 0.218158 0.218156 0.221877 0.235721 0.197080 0.325253 0.235711 0.197074 0.325286
chargesum: 0.00000
title: Mulliken charges with hydrogens summed into heavy atoms:
elementType: O O N N C C C C C C C C C C C C C C C C C C C C C C
charge: -0.312703 -0.312699 -0.105077 -0.105084 -0.061371 -0.061353 0.175765 0.175769 -0.034190 -0.034194 -0.026935 -0.026941 -0.008830 -0.008835 0.013321 0.013319 0.571155 0.571145 -0.286563 -0.158659 -0.158666 -0.286567 0.285896 0.285875 -0.051790 -0.051790
polarizability: 3.21567968e+02 1.30849595e-03 2.22751236e+02 -3.42981195e+00 5.01045955e-04 2.10584151e+02
1716.lowfreq: -11.9333 -0.0008 -0.0003 0.0005 1.1154 13.6548 21.3380 27.4560 46.4623
frequency: 21.2930 27.4390 46.0765 50.3926 57.0039 66.9541 77.3990 93.0965 100.3065 114.0342 121.9917 134.9004 156.3131 185.1725 202.2412 203.3312 208.3618 213.1220 224.4783 261.8378 270.4631 311.5841 316.0756 319.4858 330.3786 380.7157 395.6367 398.1033 402.3249 421.0871 445.3202 449.1962 456.5860 463.9584 482.0593 524.9951 530.5220 556.0571 558.0121 568.5224 604.4866 605.8604 615.3962 617.2499 629.0283 640.1515 747.1657 755.3066 773.4597 802.8980 818.7624 832.3281 838.5755 842.2138 842.8520 867.4007 872.8075 893.3737 896.7638 920.4184 920.9118 942.1019 952.2962 961.4470 964.4296 965.5553 965.6278 999.2025 999.3752 1013.7534 1045.8717 1046.5164 1055.6115 1055.9164 1056.9149 1058.2349 1086.3632 1096.1289 1106.7708 1112.0396 1115.5184 1123.5699 1126.7665 1131.5118 1142.5968 1193.6230 1198.6358 1199.4501 1208.5882 1211.6127 1230.0482 1231.1122 1233.8653 1235.1720 1262.6205 1264.8099 1283.6067 1287.9967 1288.7861 1289.0039 1303.7207 1306.3677 1319.8965 1326.4342 1326.6197 1335.3756 1336.2262 1338.2269 1338.6138 1342.7597 1346.6338 1346.8438 1358.3226 1385.0368 1404.7459 1406.9040 1414.7072 1457.9454 1458.3725 1458.4629 1459.8561 1459.8773 1461.8351 1466.3310 1466.9024 1468.5518 1473.0167 1473.6820 1485.9133 1490.5384 1493.6431 1506.2039 1581.9730 1594.6992 1606.1652 1624.7603 2933.8555 2934.0093 2952.6425 2952.6692 2959.1191 2960.1448 2966.2581 2966.3380 2971.6087 2971.6331 2977.1265 2977.1488 3021.1638 3021.2740 3030.3492 3030.5012 3033.6357 3033.6954 3040.7030 3040.7505 3047.0953 3047.1726 3057.1561 3059.2566 3094.3490 3095.1662 3107.6487 3107.8115 3135.8738 3141.4866 3540.1388 3540.1907
redmass: 4.0059 3.9101 3.4722 6.7846 3.5597 4.2641 9.9928 3.4624 4.4108 3.3076 3.2212 3.4654 5.1393 3.4713 1.0424 2.0146 1.8983 2.5309 1.9306 2.6385 3.9466 2.8906 3.8807 1.8508 2.2029 3.7088 2.9553 2.8937 2.7874 2.5543 2.9860 2.9908 3.0463 3.0086 2.7414 2.3309 2.1800 1.5345 1.4668 2.2485 2.9048 3.1309 3.5691 3.3009 3.5575 6.3359 3.4390 2.3027 1.9093 2.1020 1.9379 2.3801 1.4546 1.7961 2.0429 1.5185 1.6315 2.6555 2.6436 2.4681 2.4864 1.6472 2.1851 1.9404 2.2980 1.5480 2.4746 1.6077 1.5804 2.6722 1.8271 1.8013 1.3700 1.3809 1.5753 1.5896 2.2196 3.0988 2.2852 2.3607 2.7903 2.3916 1.9118 2.1425 1.7267 1.2553 1.4929 1.4059 1.4811 1.9878 1.4519 1.5034 1.4802 1.5247 1.6594 1.5866 1.4144 1.5196 1.3011 1.2938 1.3736 1.4358 1.2806 1.2893 1.2831 1.4050 1.4238 1.4047 1.4157 1.5671 1.5300 1.5176 1.4393 4.9068 1.2281 1.2203 2.4245 1.0760 1.0919 1.0760 1.0891 1.0897 1.0512 1.1757 1.0860 1.2230 1.1030 1.1051 1.5823 1.4493 1.2451 2.6458 6.4131 5.8634 5.5438 6.5114 1.0820 1.0822 1.0662 1.0662 1.0416 1.0411 1.0635 1.0634 1.0621 1.0622 1.0616 1.0616 1.0850 1.0849 1.0953 1.0952 1.0993 1.0993 1.0987 1.0987 1.1014 1.1014 1.0945 1.0950 1.0990 1.0988 1.0871 1.0875 1.0943 1.0956 1.0769 1.0769
irintensity: 1.1335 0.7683 0.2195 7.1954 0.4981 0.0666 10.2815 0.0066 17.6164 2.6514 3.0755 13.8411 1.2848 12.7802 0.9870 0.3420 2.3499 6.4647 3.2171 0.5856 0.8370 0.0035 0.5699 0.9046 0.8244 0.7967 3.2053 0.4662 0.0001 0.0147 4.9305 2.0965 9.0520 8.8486 1.0265 10.9992 3.2157 32.6765 174.8601 55.1565 0.0640 0.4695 0.7061 6.9007 0.5511 0.9135 0.0727 4.0821 0.1911 1.2869 27.2390 11.4373 7.4778 12.6992 0.3105 5.1445 3.2014 0.6506 6.8331 1.8533 5.3532 0.0781 1.5797 2.0827 6.7316 2.9313 6.2447 7.8571 0.4159 1.7533 2.3084 5.6691 7.5949 0.4321 23.8423 5.6830 8.6523 6.1972 3.7008 0.8330 16.5140 8.2131 0.3712 10.5454 23.5539 3.4762 0.2193 5.0310 1.9240 0.7692 4.1160 0.4838 4.8839 3.7578 34.5465 30.6425 2.6614 3.2247 7.2140 0.0018 48.0095 82.4636 0.2921 0.2022 0.2165 0.1769 0.0469 0.6972 0.9551 4.4973 0.5154 3.5585 0.2538 0.4488 87.5420 41.6004 10.2684 11.4981 3.8117 3.3443 19.4686 2.3128 0.0662 102.4653 8.6728 53.6502 2.4232 33.3456 222.9832 42.9384 47.4250 35.8326 0.4388 39.5297 280.9765 0.0006 33.9705 2.5157 60.5739 10.2370 13.3785 117.9322 48.0364 34.7137 66.7103 3.2126 37.3475 13.4876 2.4926 51.9038 84.4345 45.0897 77.9906 27.4239 12.0935 0.0572 21.8610 143.9529 3.4027 25.5364 24.7781 12.6455 0.0322 40.3168 39.0035 0.0443 18.1406 3.2177
temp: 298.150 k
press: 1.00000 atm
elementType: 8 8 7 7 6 6 6 6 6 6 6 6 6 6 6 6 6 6 6 6 6 6 6 6 6 6 1 1 1 1 1 1 1 1 1 1 1 1 1 1 1 1 1 1 1 1 1 1 1 1 1 1 1 1 1 1 1 1
symmnumber: 1
zpe: 1318293.3 jmol-1
zpe.correction: 0.502111 hartree
zpe.thermalcorrener: 0.527751 hartree
zpe.thermalcorrenthalpy: 0.528695 hartree
zpe.thermalcorrgfe: 0.446215 hartree
zpe.sumelectzpe: -1115.570553 hartree
zpe.sumelectthermal: -1115.544913 hartree
zpe.sumelectthermalent: -1115.543969 hartree
zpe.sumelectthermalfe: -1115.626450 hartree
dipole: -0.0009 -2.6239 0.0001
dipole: 2.6239
quadrupole: -135.4280 -164.8012 -149.1164
quadrupole: -0.0019 -13.0220 0.0009
quadrupole: 14.3538 -15.0193 0.6655 -0.0019 -13.0220 0.0009
hfenergy: -1116.0726645 hartree
pointgroup: C01 [X(C22H32N2O2)]
dipole: 0.0001787 -1.0323045 -0.0000675 debye
polarizability: 321.4881967|-0.01827|222.7512393|-4.5398426|0.0007467|210.6639182 unknown
InChI: InChI=1S/C22H32N2O2/c1-15(25)23-21-9-5-3-7-19(21)17-11-13-18(14-12-17)20-8-4-6-10-22(20)24-16(2)26/h11-14,19-24H,3-10H2,1-2H3
charge 0 multiplicity 1
58 atoms
O  1.820321 2.38098 0.904911
O  -1.819523 2.381637 -0.904836
N  2.867843 1.313388 -0.87901
N  -2.867388 1.314365 0.879062
C  2.937256 -1.151484 -0.405633
C  -2.937757 -1.150401 0.405382
C  3.525582 0.264986 -0.078537
C  -3.525606 0.26632 0.078517
C  3.693716 -2.243863 0.402965
C  -3.694624 -2.242392 -0.403353
C  5.058829 0.30166 -0.301578
C  -5.058817 0.30349 0.301702
C  5.218825 -2.19753 0.16217
C  -5.219699 -2.195585 -0.162451
C  5.78745 -0.80057 0.500507
C  -5.787878 -0.798368 -0.500499
C  1.425954 -1.198887 -0.190718
C  -1.426475 -1.198337 0.190447
C  0.536221 -1.207425 -1.293692
C  -0.862219 -1.197514 -1.110019
C  0.861698 -1.197997 1.109747
C  -0.536746 -1.207362 1.293418
C  2.037305 2.28705 -0.347628
C  -2.036395 2.287658 0.347718
C  1.390572 3.224584 -1.357875
C  -1.38901 3.224698 1.358006
H  3.137945 -1.340668 -1.484194
H  -3.138501 -1.339665 1.48392
H  3.298922 0.511992 0.976037
H  -3.29895 0.513389 -0.976044
H  3.49704 -2.103594 1.484989
H  3.285729 -3.237039 0.134811
H  -3.286953 -3.235748 -0.135388
H  -3.497966 -2.102009 -1.485365
H  5.436075 1.304065 -0.024913
H  5.270939 0.162421 -1.383879
H  -5.435742 1.306069 0.025228
H  -5.270883 0.164153 1.383999
H  5.721134 -2.97485 0.769744
H  5.433507 -2.433287 -0.901091
H  -5.722316 -2.972624 -0.770129
H  -5.43439 -2.43146 0.900782
H  5.662039 -0.607618 1.585833
H  6.873954 -0.762168 0.292355
H  -5.662486 -0.60528 -1.585804
H  -6.874352 -0.759627 -0.292254
H  2.985016 1.277916 -1.893573
H  -2.984451 1.278799 1.893635
H  0.945164 -1.209514 -2.312364
H  -1.514083 -1.173835 -1.990989
H  1.51357 -1.174692 1.990721
H  -0.945688 -1.209412 2.31209
H  1.520814 4.26674 -1.019527
H  1.808408 3.123836 -2.375571
H  0.302058 3.019645 -1.393807
H  -1.518765 4.266978 1.019849
H  -1.806727 3.124004 2.375756
H  -0.300598 3.019181 1.393723
