program: Gaussian 09
title: 000270586
version: EM64L-G09RevD.01
frameworkgroup: C1[X(C14H12O5)]
method: RPBEPBE
basis: SDD
operation: Freq
keyword: #pfreq=noraman
keyword: PBEPBE/SDD
title: #p freq=noraman PBEPBE/SDD
converged: YES YES NO NO
title: Mulliken charges:
elementType: O O O O O C C C C C C C C C C C C C C H H H H H H H H H H H H
charge: -0.290192 -0.259355 -0.220303 -0.127262 -0.147765 0.285949 -0.611223 0.357945 0.025476 -0.442043 0.054171 -0.468805 0.046003 -0.376359 0.222428 0.199020 -0.328197 -0.535813 -0.493204 0.268811 0.301085 0.305486 0.270502 0.281443 0.263365 0.249845 0.229120 0.229823 0.233402 0.229717 0.246928
chargesum: 0.00000
title: Mulliken charges with hydrogens summed into heavy atoms:
elementType: O O O O O C C C C C C C C C C C C C C
charge: -0.290192 -0.259355 -0.220303 -0.127262 -0.147765 0.285949 -0.041327 0.357945 0.025476 -0.136557 0.054171 -0.198303 0.046003 -0.094916 0.222428 0.199020 -0.064832 0.172976 0.216843
polarizability: 2.91408493e+02 9.85018785e-01 1.86943264e+02 6.06406844e+00 -7.07339617e+00 9.54931374e+01
1716.lowfreq: -7.2890 -4.5120 -0.0010 -0.0009 -0.0007 3.8977 23.1532 37.1130 40.2925
frequency: 23.0745 37.1114 40.2900 51.1697 91.5778 96.4619 102.6752 138.9790 155.0627 178.9676 198.0955 209.8393 226.1193 259.7689 285.2561 299.0291 316.0449 337.5562 358.9403 382.3359 401.9035 462.7036 478.9351 489.1528 542.0939 565.1007 585.0599 616.2615 642.2215 692.4374 706.7031 707.9080 724.9484 745.7574 765.5421 843.4912 867.9768 874.7745 898.4991 936.6826 944.4394 962.6716 977.8525 995.9026 1055.4539 1098.1928 1107.5686 1109.9809 1113.9825 1116.4046 1151.3171 1155.3641 1174.3153 1185.8851 1228.1951 1249.8485 1267.1457 1282.2115 1334.8046 1371.7351 1410.1892 1413.4760 1437.8606 1447.5251 1458.1199 1461.6058 1467.5677 1471.5315 1499.6275 1507.5491 1566.9202 1573.6532 1605.9153 1622.7726 1676.4890 2964.8525 3005.8092 3006.7949 3055.6812 3056.1527 3117.4981 3130.1032 3136.9076 3159.5786 3170.1634 3179.0260 3189.3832
redmass: 4.5343 7.0976 3.6538 6.7708 4.0024 3.9101 4.4580 3.5493 4.8328 1.5247 2.1856 2.7911 6.5403 1.5992 3.8846 9.5376 5.4536 6.6654 4.7118 3.9712 3.8778 3.3958 5.8564 6.0381 5.8306 5.1429 4.7825 5.7443 6.2684 2.9342 4.8370 4.4485 4.8804 3.7572 7.9299 1.4571 3.8074 1.7181 1.7446 3.5705 2.1650 7.7726 1.3588 4.6139 5.0557 2.3640 1.2638 1.2579 1.6009 1.3531 1.3091 1.4227 3.0697 2.3053 1.7172 1.9642 2.0952 2.1002 5.6165 4.2583 3.1732 1.0953 1.2208 1.4466 1.0538 1.0637 1.0502 1.0904 2.9883 8.0450 8.1160 7.1350 6.2427 12.0991 12.6436 1.0328 1.0292 1.0617 1.1044 1.0980 1.1040 1.0998 1.1060 1.0880 1.0898 1.0973 1.0970
irintensity: 0.7229 0.7022 6.9329 2.1698 2.7580 20.2389 2.1722 3.0633 1.0128 0.6317 2.4631 2.6398 5.6263 2.5421 16.4657 0.7871 10.0303 6.9266 4.5247 0.4836 5.3882 2.0626 4.4361 3.4461 0.3009 5.2805 7.4374 5.7631 26.6187 0.2830 14.9246 9.9599 7.5666 47.3159 25.5218 19.2530 13.8316 30.4128 17.4164 1.8421 1.7652 51.0805 1.8610 38.1173 31.4547 10.5649 3.1109 0.0302 112.1001 22.3290 15.5026 61.6694 154.7360 21.9321 20.9023 19.5044 308.0929 285.6664 102.1129 17.6966 69.8797 33.8488 2.6185 3.1665 16.7718 38.0692 15.6988 76.9443 262.0506 224.4138 20.6708 42.6975 155.9738 275.1616 99.4116 38.1460 70.8449 2.0630 36.3326 1.7575 32.0684 18.3377 22.2056 0.5272 4.3223 4.0009 1.8608
temp: 298.150 k
press: 1.00000 atm
elementType: 8 8 8 8 8 6 6 6 6 6 6 6 6 6 6 6 6 6 6 1 1 1 1 1 1 1 1 1 1 1 1
symmnumber: 1
zpe: 598207.8 jmol-1
zpe.correction: 0.227845 hartree
zpe.thermalcorrener: 0.245967 hartree
zpe.thermalcorrenthalpy: 0.246911 hartree
zpe.thermalcorrgfe: 0.179771 hartree
zpe.sumelectzpe: -915.377201 hartree
zpe.sumelectthermal: -915.359079 hartree
zpe.sumelectthermalent: -915.358135 hartree
zpe.sumelectthermalfe: -915.425275 hartree
dipole: 6.9533 -1.9651 -0.8781
dipole: 7.2788
quadrupole: -131.7100 -113.2006 -109.1523
quadrupole: -18.1400 4.7994 6.1252
quadrupole: -13.6890 4.8204 8.8687 -18.1400 4.7994 6.1252
hfenergy: -915.6050464 hartree
pointgroup: C01 [X(C14H12O5)]
dipole: -2.8339476 0.3465858 0.2223382 debye
polarizability: 286.8118731|27.1673714|132.3880809|-3.2145691|44.506596|154.6449405 unknown
InChI: InChI=1S/C14H12O5/c1-18-12-4-3-8(7-13(12)19-2)14(17)9-5-10(15)11(16)6-9/h3-5,7H,6H2,1-2H3
charge 0 multiplicity 1
31 atoms
O  -3.189104 1.170982 0.812497
O  -4.706819 -0.973754 -0.45157
O  1.441963 -1.463072 -2.254426
O  5.072723 1.659736 0.131691
O  3.390787 1.148558 2.594229
C  1.911135 -0.019723 -0.436956
C  3.19293 0.524322 -1.05235
C  -0.513166 -0.777468 -1.008537
C  0.942277 -0.786445 -1.292334
C  1.880603 0.128019 0.932343
C  3.964874 1.085985 0.144141
C  -1.130553 0.200085 -0.176579
C  3.095406 0.817634 1.417455
C  -1.329037 -1.759664 -1.63413
C  -2.522228 0.200303 0.044197
C  -3.332389 -0.822121 -0.557826
C  -2.7086 -1.78061 -1.400665
C  -2.380423 2.229849 1.425691
C  -5.512254 -0.320954 0.603091
H  3.004773 1.307564 -1.810804
H  3.755391 -0.272962 -1.573121
H  1.101545 -0.241664 1.602017
H  -0.519333 0.99456 0.258492
H  -0.854029 -2.496928 -2.287816
H  -3.353939 -2.538591 -1.853983
H  -3.099779 2.858104 1.970475
H  -1.639501 1.811954 2.134228
H  -1.864329 2.836069 0.656703
H  -6.503991 -0.787196 0.502641
H  -5.090075 -0.523624 1.601645
H  -5.570159 0.765554 0.439661
