program: Gaussian 09
title: 000270585
version: EM64L-G09RevD.01
frameworkgroup: C1[X(C19H15NO)]
method: RPBEPBE
basis: SDD
operation: Freq
keyword: #p
keyword: freq=noraman
keyword: PBEPBE/SDD
title: #p freq=noraman PBEPBE/SDD
converged: NO NO NO NO
title: Mulliken charges:
elementType: O N C C C C C C C C C C C C C C C C C C C H H H H H H H H H H H H H H H
charge: -0.268015 -0.058392 0.387407 0.127621 0.256011 0.414274 0.417750 -0.624151 -0.619172 -0.038978 -0.071148 -0.366875 -0.427204 -0.421352 -0.327796 -0.270293 -0.241430 -0.241412 -0.238252 -0.216436 -0.683048 0.232692 0.278014 0.218958 0.242901 0.246622 0.256870 0.226360 0.229694 0.230056 0.229083 0.226585 0.226601 0.210790 0.227831 0.227833
chargesum: 0.00000
title: Mulliken charges with hydrogens summed into heavy atoms:
elementType: O N C C C C C C C C C C C C C C C C C C C
charge: -0.268015 -0.058392 0.387407 0.127621 0.256011 0.414274 0.417750 -0.391459 -0.341158 -0.038978 -0.071148 -0.147917 -0.184302 -0.174730 -0.070927 -0.043933 -0.011736 -0.011356 -0.009169 0.236749 -0.016593
polarizability: 3.74749177e+02 2.88279840e+01 2.71105414e+02 1.15530518e-03 -3.09645684e-03 8.98941940e+01
1716.lowfreq: -0.0013 -0.0004 0.0011 2.2515 8.0654 8.8393 47.3346 64.8586 73.3785
frequency: 47.2592 64.8504 73.3744 94.1367 95.8480 134.7534 158.2394 164.0948 233.3996 256.3053 277.6972 285.2793 292.9302 327.6173 329.4773 365.7290 412.1538 466.0615 477.5067 478.7766 529.2032 533.5413 545.0330 566.8644 582.9288 621.9750 632.9452 637.9015 702.9419 715.6339 730.6241 763.0777 768.5058 775.2242 784.1172 795.1401 802.2667 842.2231 864.1192 878.7623 885.6378 899.2016 909.6018 940.6986 955.5956 969.5040 972.4328 987.9166 993.1386 1015.2676 1020.7399 1033.6112 1075.3715 1109.5736 1114.4061 1136.0529 1137.2506 1169.7488 1172.4955 1205.7409 1218.8131 1235.8342 1243.7816 1251.0372 1283.7703 1304.9101 1316.4528 1326.2486 1370.7747 1375.8544 1399.5459 1406.3455 1423.0899 1434.0810 1436.5243 1459.9260 1462.1111 1465.8273 1473.6597 1487.2204 1493.0834 1540.9592 1562.9343 1570.1189 1607.2624 1615.4289 1636.6064 2991.1726 3010.9110 3067.6749 3089.8167 3100.5225 3118.6978 3124.4669 3125.2304 3134.5409 3140.3786 3141.7981 3154.6499 3158.7264 3160.5440 3168.5408
redmass: 3.2791 4.8661 3.0817 3.7386 2.4376 3.2977 4.8258 5.1193 1.5279 2.5335 4.0468 5.7294 5.5510 4.2189 4.6553 5.5371 3.3771 3.1481 2.7960 6.1463 6.6442 3.5670 6.9763 3.5272 6.0840 6.6653 6.6676 5.0285 6.4532 6.6716 3.5246 1.3711 1.4141 4.8354 3.0559 2.3842 1.0957 3.5417 1.4017 1.6574 6.3708 5.9932 1.6057 1.7062 1.3853 5.5551 1.4235 1.3262 1.3497 2.3348 2.3418 2.0036 3.9047 2.0821 2.0486 1.6654 1.4589 1.1174 1.0778 1.7039 1.6883 1.7292 1.1357 3.6020 1.5986 2.0730 2.1193 2.4663 1.8718 4.5084 1.3077 5.8057 2.8032 5.9084 3.2012 3.0069 1.0405 2.4223 1.1503 1.0917 3.5626 6.8271 6.3937 7.6863 6.2133 6.4937 6.9486 1.0355 1.0580 1.1056 1.0987 1.1032 1.0858 1.0886 1.0853 1.0904 1.0900 1.0946 1.0950 1.0926 1.0995 1.0992
irintensity: 0.7979 1.2454 0.0699 1.3059 2.0763 1.1945 0.1232 0.1050 0.0081 1.4426 1.4985 1.9674 2.4438 0.5814 0.3150 1.2053 0.0252 0.3051 26.4047 4.7113 1.2297 3.8408 1.2779 0.0296 5.0440 3.9201 12.5620 0.0172 7.4683 4.2811 1.9189 40.5019 106.6297 1.0529 0.8081 8.6290 3.9122 15.8756 1.7184 1.3868 2.7015 8.1294 40.8673 4.7365 1.7781 8.7333 14.3962 0.0768 0.0282 8.3750 44.8591 7.7345 90.0165 5.7552 20.5630 42.3255 4.8664 0.4965 1.1180 5.5736 124.3840 29.3697 0.0013 4.4369 0.5729 143.3390 98.2118 3.2619 46.3512 0.8948 17.9854 6.7656 1.6278 11.7054 15.6233 45.7727 11.9637 50.4923 0.2708 10.7169 7.7923 154.6151 11.5705 12.9717 31.5351 0.9815 12.8397 25.7881 16.5926 3.5530 30.7885 49.6895 2.4127 0.1696 0.3515 10.4334 3.8020 30.2201 32.4353 2.0750 44.8941 29.3348
temp: 298.150 k
press: 1.00000 atm
elementType: 8 7 6 6 6 6 6 6 6 6 6 6 6 6 6 6 6 6 6 6 6 1 1 1 1 1 1 1 1 1 1 1 1 1 1 1
symmnumber: 1
zpe: 747082.1 jmol-1
zpe.correction: 0.284549 hartree
zpe.thermalcorrener: 0.300948 hartree
zpe.thermalcorrenthalpy: 0.301892 hartree
zpe.thermalcorrgfe: 0.240562 hartree
zpe.sumelectzpe: -861.599686 hartree
zpe.sumelectthermal: -861.583286 hartree
zpe.sumelectthermalent: -861.582342 hartree
zpe.sumelectthermalfe: -861.643672 hartree
dipole: 0.9823 0.1316 0.0001
dipole: 0.9910
quadrupole: -105.4809 -101.3774 -128.8174
quadrupole: -2.9338 -0.0001 -0.0004
quadrupole: 6.4110 10.5145 -16.9255 -2.9338 -0.0001 -0.0004
hfenergy: -861.8842342 hartree
pointgroup: C01 [X(C19H15N1O1)]
dipole: 0.3881911 0.0365605 0.0001372 debye
polarizability: 376.8528851|24.6695858|269.0016692|0.0676033|0.0664018|89.8942306 unknown
InChI: InChI=1S/C19H15NO/c1-2-21-19-17-12-14-8-4-3-7-13(14)11-16(17)15-9-5-6-10-18(15)20-19/h3-12H,2H2,1H3
charge 0 multiplicity 1
36 atoms
O  -1.058224 2.759085 0.001005
N  -2.412191 0.845101 0.000087
C  -0.036843 -0.819541 0.000043
C  0.053245 0.630853 0.000552
C  -1.375345 -1.430752 -0.000439
C  2.437871 -0.923328 0.000513
C  2.512203 0.527478 0.001023
C  1.163154 -1.558278 0.00004
C  1.302049 1.275652 0.001029
C  -2.520318 -0.560028 -0.000394
C  -1.20534 1.382889 0.000532
C  -1.598161 -2.838185 -0.000951
C  3.663161 -1.680282 0.000502
C  3.803505 1.163183 0.001499
C  -3.833047 -1.109424 -0.000855
C  -2.898654 -3.369902 -0.001403
C  4.898189 -1.035257 0.00097
C  4.97036 0.401621 0.001475
C  -4.025181 -2.500293 -0.001356
C  -2.312593 3.566678 0.00106
C  -1.879273 5.028772 0.002025
H  1.136532 -2.653406 -0.000334
H  1.33382 2.369472 0.001404
H  -0.745379 -3.525642 -0.000996
H  3.605575 -2.775658 0.000118
H  3.849533 2.258886 0.001879
H  -4.675684 -0.41118 -0.000805
H  -3.046003 -4.455608 -0.001791
H  5.827096 -1.616596 0.000958
H  5.952144 0.888039 0.001839
H  -5.03879 -2.916828 -0.001709
H  -2.901214 3.293778 -0.893272
H  -2.901818 3.292748 0.894673
H  -2.769965 5.683156 0.001789
H  -1.277193 5.261383 0.898089
H  -1.276119 5.262217 -0.893101
