program: Gaussian 09
title: 000270584
version: EM64L-G09RevD.01
frameworkgroup: C1[X(C17H11NO)]
method: RPBEPBE
basis: SDD
operation: Freq
keyword: #p
keyword: freq=noraman
keyword: PBEPBE/SDD
title: #p freq=noraman PBEPBE/SDD
converged: NO YES NO YES
title: Mulliken charges:
elementType: O N C C C C C C C C C C C C C C C C C H H H H H H H H H H H
charge: -0.259155 -0.442573 0.275671 0.314118 0.307471 0.391888 0.110144 0.443980 -0.625066 -0.661406 -0.024301 -0.371705 -0.349873 -0.434223 -0.423586 -0.239500 -0.241102 -0.249231 -0.239107 0.229700 0.237645 0.331935 0.224928 0.278418 0.243900 0.243098 0.230748 0.236363 0.230872 0.229952
chargesum: 0.00000
title: Mulliken charges with hydrogens summed into heavy atoms:
elementType: O N C C C C C C C C C C C C C C C C C
charge: -0.259155 -0.110639 0.275671 0.314118 0.307471 0.391888 0.110144 0.443980 -0.395367 -0.423761 -0.024301 -0.146777 -0.071456 -0.190323 -0.180488 -0.008753 -0.004739 -0.018359 -0.009155
polarizability: 3.75009216e+02 -2.70256856e+00 2.07971211e+02 2.10906521e-03 -2.35556606e-02 7.21356712e+01
1716.lowfreq: -0.0003 0.0004 0.0008 4.9103 6.1151 13.7808 61.8151 66.8481 124.4520
frequency: 61.8099 66.8474 124.4509 157.6759 166.7312 189.0501 280.8253 281.3447 324.1935 326.1255 334.3032 419.9372 433.4061 468.9672 472.1119 478.0355 518.2957 538.7017 559.6236 583.4326 624.2322 639.7833 647.1585 693.3571 715.2571 733.3172 741.7593 759.2020 772.9628 776.9246 787.9305 795.7661 843.3132 853.1706 890.6397 895.0817 902.7448 920.8675 964.1327 979.6487 983.6175 990.1954 1007.6264 1021.1094 1040.7551 1082.0950 1129.4664 1141.9645 1173.4103 1178.0251 1200.5437 1218.3373 1241.5577 1284.9311 1286.9804 1301.6710 1315.2442 1336.5271 1384.2153 1389.7250 1417.8671 1431.4073 1441.9764 1454.8010 1476.1896 1487.2158 1522.4827 1567.4658 1581.3059 1606.4189 1617.2068 1632.4406 1644.2125 3118.7761 3121.0461 3125.9485 3131.8556 3140.9010 3143.8958 3148.1707 3158.7932 3163.2124 3170.6422 3513.0660
redmass: 5.1962 4.7736 4.6611 5.1779 5.5939 4.9364 6.6347 3.9665 7.2869 4.3644 6.8112 3.1403 3.7588 5.9728 2.5468 7.6225 3.4366 7.4596 3.4196 7.0581 6.5818 6.3779 2.1791 6.1971 3.4743 1.5345 6.0092 1.3015 5.3960 2.1265 1.9205 2.5546 4.7102 1.4076 1.5685 1.4985 5.2870 2.0697 1.4069 1.3798 4.9416 1.3429 1.3411 2.2608 2.1971 3.2348 1.7376 1.9297 1.0757 1.0873 1.3716 1.7748 1.8579 1.5575 2.6688 2.1137 3.0246 2.3124 3.4433 4.6898 4.1529 3.1262 3.6727 2.3497 3.2689 3.0470 4.3846 6.0097 7.1370 6.3488 6.1324 5.3073 7.0397 1.0912 1.0862 1.0890 1.0860 1.0906 1.0948 1.0891 1.0941 1.1003 1.1003 1.0762
irintensity: 1.2143 0.6139 0.1031 0.0260 4.5808 0.3843 1.3946 0.9447 11.5709 0.0817 0.3491 4.2315 0.1359 7.4997 18.9954 1.0297 0.6904 1.2201 1.0003 15.6842 1.0917 2.5859 2.2406 0.0037 1.3318 141.8560 0.4924 11.3993 0.4593 33.9562 42.7400 0.4867 1.7903 9.9248 74.3150 3.7950 2.2135 0.1067 9.8044 3.0362 1.0258 0.0270 0.5143 6.4655 14.3432 0.2291 8.4107 22.1473 2.0885 1.7842 11.7800 12.6801 3.4370 3.6435 8.3522 32.9547 93.6984 75.5226 39.0698 18.6369 0.7386 10.5436 14.2564 1.0012 0.6158 28.4905 35.8181 7.8921 3.8484 77.1044 27.2319 436.0402 48.2887 9.0739 7.8759 0.4583 4.4395 3.7858 30.5820 5.3754 11.7278 44.2157 29.7902 30.5947
temp: 298.150 k
press: 1.00000 atm
elementType: 8 7 6 6 6 6 6 6 6 6 6 6 6 6 6 6 6 6 6 1 1 1 1 1 1 1 1 1 1 1
symmnumber: 1
zpe: 605600.0 jmol-1
zpe.correction: 0.230661 hartree
zpe.thermalcorrener: 0.243882 hartree
zpe.thermalcorrenthalpy: 0.244827 hartree
zpe.thermalcorrgfe: 0.190945 hartree
zpe.sumelectzpe: -783.181841 hartree
zpe.sumelectthermal: -783.168620 hartree
zpe.sumelectthermalent: -783.167676 hartree
zpe.sumelectthermalfe: -783.221558 hartree
dipole: 2.8269 -2.6185 -0.0004
dipole: 3.8533
quadrupole: -102.2507 -98.8789 -116.3833
quadrupole: 15.3263 0.0013 -0.0067
quadrupole: 3.5869 6.9588 -10.5457 15.3263 0.0013 -0.0067
hfenergy: -783.4125023 hartree
pointgroup: C01 [X(C17H11N1O1)]
dipole: -1.1036879 -1.0393263 0.0001397 debye
polarizability: 374.953396|4.0773606|208.0270315|0.0019151|0.0235722|72.1356712 unknown
InChI: InChI=1S/C17H11NO/c19-17-14-8-4-3-7-13(14)15-9-11-5-1-2-6-12(11)10-16(15)18-17/h1-10,18H
charge 0 multiplicity 1
30 atoms
O  3.141523 2.711707 0.000141
N  0.911521 2.078404 0.0008
C  0.164307 -0.261305 0.000406
C  -0.146034 1.153153 0.000536
C  1.582619 -0.671347 0.000285
C  -2.270629 -0.738371 0.0001
C  2.607482 0.327626 0.00047
C  -2.560997 0.684107 0.000233
C  -0.910698 -1.165814 0.000161
C  -1.473885 1.604399 0.000415
C  2.279882 1.778582 0.001236
C  1.989442 -2.03677 -0.00015
C  3.978238 -0.034751 0.000106
C  -3.361511 -1.672258 -0.000133
C  -3.931329 1.112902 0.000145
C  3.350034 -2.389882 -0.000467
C  4.35554 -1.387584 -0.00035
C  -4.683248 -1.225879 -0.00021
C  -4.968879 0.179652 -0.00007
H  -0.717277 -2.243698 -0.000032
H  -1.683384 2.68164 0.000505
H  0.69138 3.079306 0.000716
H  1.239216 -2.833214 -0.000291
H  4.717702 0.772722 0.000292
H  -3.139317 -2.746132 -0.000246
H  -4.151739 2.186986 0.000245
H  3.634242 -3.448075 -0.000828
H  5.413887 -1.668341 -0.000591
H  -5.509873 -1.944387 -0.000383
H  -6.011412 0.516522 -0.000139
