program: Gaussian 09
title: 000270573
version: EM64L-G09RevD.01
frameworkgroup: C1[X(C14H12O4)]
method: RPBEPBE
basis: SDD
operation: Freq
keyword: #pfreq=noraman
keyword: PBEPBE/SDD
title: #p freq=noraman PBEPBE/SDD
converged: YES YES NO NO
title: Mulliken charges:
elementType: O O O O C C C C C C C C C C C C C C H H H H H H H H H H H H
charge: -0.241568 -0.243367 -0.243367 -0.241568 0.247936 0.224902 0.224902 0.247936 -0.267348 -0.267348 -0.331012 -0.330145 -0.330144 -0.331014 -0.220289 -0.220886 -0.220886 -0.220288 0.204770 0.236769 0.236769 0.204770 0.236696 0.243494 0.243493 0.236696 0.229527 0.230521 0.230521 0.229527
chargesum: 0.00000
title: Mulliken charges with hydrogens summed into heavy atoms:
elementType: O O O O C C C C C C C C C C C C C C
charge: -0.241568 -0.243367 -0.243367 -0.241568 0.247936 0.224902 0.224902 0.247936 0.174191 0.174192 -0.094316 -0.086651 -0.086651 -0.094317 0.009239 0.009635 0.009635 0.009239
polarizability: 1.40785300e+02 -6.30925802e+00 1.67136182e+02 -1.47399777e-03 1.20824994e-03 1.52559702e+02
1716.lowfreq: -0.0012 -0.0009 -0.0008 5.2265 8.4183 16.8218 33.4084 56.3486 83.5150
frequency: 32.8376 56.2020 83.4741 114.4289 121.1652 199.2826 239.3606 247.3859 251.5704 263.2799 347.6784 350.2177 424.7236 429.8417 445.1370 477.7898 490.0394 491.0751 506.1442 551.1085 571.5062 572.3702 578.1052 586.5337 703.3753 704.8363 738.4816 738.9800 759.7669 761.9581 781.9245 786.5555 845.0398 849.8565 882.2123 911.2731 930.2682 933.2210 957.0537 962.2566 972.3833 973.5121 1030.7918 1033.5136 1070.8868 1094.4415 1109.5021 1110.1294 1146.1326 1165.3317 1166.8880 1184.9438 1196.0239 1231.6247 1247.3708 1252.4385 1273.4653 1275.2744 1367.4679 1370.2097 1384.6083 1392.1722 1425.4067 1432.3097 1437.5277 1443.9414 1467.9449 1478.3903 1588.6250 1589.8588 1592.6578 1596.0288 2960.7957 2961.9595 3131.6864 3131.8787 3139.4948 3139.5940 3140.9283 3141.4896 3151.8288 3152.1624 3169.7866 3170.0369
redmass: 5.5447 6.8869 4.8451 4.3939 5.0336 3.0958 6.3456 2.7538 5.9357 9.7159 4.4009 4.2214 4.1446 4.4324 6.3034 4.0525 5.8445 5.6116 5.7288 3.6763 5.4852 6.0506 4.1718 3.5797 4.9611 4.7459 3.7284 4.2621 1.3447 1.2966 5.6251 5.9769 1.6033 1.4425 6.9174 5.6123 1.4270 1.5487 6.7650 6.1385 1.3073 1.3806 2.0732 2.0022 3.7268 2.2279 1.7542 1.7463 1.7286 1.0982 1.0675 2.7495 2.7028 3.4208 1.4604 1.5425 1.0902 1.0821 9.5470 9.7954 1.1917 1.1532 1.6665 2.0748 1.1313 1.3055 2.6904 2.6195 7.2916 6.8668 6.9788 6.4511 1.0652 1.0655 1.0850 1.0850 1.0906 1.0893 1.0998 1.0987 1.0948 1.0948 1.1009 1.1009
irintensity: 0.0000 0.5516 0.2759 1.0798 0.9644 11.9828 0.2783 0.2451 1.2692 8.5894 5.0496 1.0210 9.9960 15.3945 0.0663 36.6363 18.9356 0.1281 4.7707 1.7690 4.1492 0.7121 0.0168 8.6372 11.1735 0.9001 3.0339 0.9800 100.5799 47.0120 0.4970 0.4520 0.1198 4.9970 0.6992 618.4556 2.5699 120.1590 2.2076 66.8694 0.0014 4.1672 17.2399 11.3321 0.1530 77.0335 14.2281 20.9058 0.1513 15.6732 2.9052 72.6446 201.4844 103.0471 0.0668 6.6491 31.6783 0.1576 0.7986 3.2241 0.0095 12.8796 7.4302 0.8103 13.9722 29.4309 84.0821 116.1992 2.7579 1.8741 5.4733 12.0914 78.8564 10.6571 0.7537 1.9366 27.8906 4.4790 19.7973 10.0610 0.1602 35.6001 12.4402 20.0874
temp: 298.150 k
press: 1.00000 atm
elementType: 8 8 8 8 6 6 6 6 6 6 6 6 6 6 6 6 6 6 1 1 1 1 1 1 1 1 1 1 1 1
symmnumber: 1
zpe: 599160.2 jmol-1
zpe.correction: 0.228208 hartree
zpe.thermalcorrener: 0.242453 hartree
zpe.thermalcorrenthalpy: 0.243398 hartree
zpe.thermalcorrgfe: 0.186912 hartree
zpe.sumelectzpe: -840.232721 hartree
zpe.sumelectthermal: -840.218475 hartree
zpe.sumelectthermalent: -840.217531 hartree
zpe.sumelectthermalfe: -840.274017 hartree
dipole: -0.0003 -0.0006 4.9188
dipole: 4.9188
quadrupole: -107.5259 -83.7474 -106.5963
quadrupole: -0.4571 -0.0001 0.0025
quadrupole: -8.2360 15.5425 -7.3065 -0.4571 -0.0001 0.0025
hfenergy: -840.4609287 hartree
pointgroup: C01 [X(C14H12O4)]
dipole: 0.0001116 0.0002187 1.9351904 debye
polarizability: 140.8413773|-6.4250503|167.0801053|0.0014793|-0.0012017|152.5597018 unknown
InChI: InChI=1S/C14H12O4/c1-2-6-12-11(5-1)15-9-17-13-7-3-4-8-14(13)18-10-16-12/h1-8H,9-10H2
charge 0 multiplicity 1
30 atoms
O  -1.046921 -1.369227 -1.507879
O  1.385205 -1.417623 -1.474457
O  -1.385348 1.41738 -1.474617
O  1.046773 1.368972 -1.508299
C  -1.613592 -0.762529 -0.362229
C  1.787865 -0.647447 -0.352406
C  -1.787878 0.647452 -0.352349
C  1.613575 0.762532 -0.362578
C  0.152525 -2.180412 -1.332552
C  -0.152651 2.1802 -1.333019
C  -2.092986 -1.53212 0.72345
C  2.433639 -1.270801 0.737876
C  -2.433524 1.271048 0.737871
C  2.093092 1.532364 0.722876
C  -2.718242 -0.901703 1.821974
C  2.890656 -0.500939 1.830635
C  -2.890415 0.501429 1.830854
C  2.718477 0.90219 1.821466
H  0.132279 -2.693222 -0.34778
H  0.158064 -2.880016 -2.178803
H  -0.158283 2.879614 -2.179427
H  -0.132294 2.693231 -0.348365
H  -1.997274 -2.623372 0.69274
H  2.5871 -2.355432 0.70931
H  -2.586986 2.355673 0.709083
H  1.997374 2.623608 0.691937
H  -3.086902 -1.506974 2.656894
H  3.391305 -0.990463 2.672458
H  -3.390965 0.99114 2.672627
H  3.087232 1.507646 2.65621
