program: Gaussian 09
title: 000270571
version: EM64L-G09RevD.01
frameworkgroup: C1[X(C23H26O7)]
method: RPBEPBE
basis: SDD
operation: Freq
keyword: #pfreq=noraman
keyword: PBEPBE/SDD
title: #p freq=noraman PBEPBE/SDD
converged: YES YES NO NO
title: Mulliken charges:
elementType: O O O O O O O C C C C C C C C C C C C C C C C C C C C C C C H H H H H H H H H H H H H H H H H H H H H H H H H H
charge: -0.279843 -0.231200 -0.216665 -0.269412 -0.289059 -0.304099 -0.299194 -0.434465 -0.250835 0.483638 -0.550695 0.149628 0.542101 0.014966 0.216545 -0.587808 -0.541963 -0.519180 -0.456666 0.203574 0.216159 0.207153 -0.349040 0.177349 -0.261411 -0.661622 -0.492929 -0.535750 -0.530164 -0.530111 0.276362 0.268792 0.266017 0.264629 0.270176 0.295634 0.276983 0.243138 0.249139 0.234807 0.222254 0.225664 0.254810 0.216066 0.235999 0.234842 0.225875 0.240616 0.233286 0.232331 0.224346 0.251843 0.230051 0.255753 0.222360 0.229224
chargesum: 0.00000
title: Mulliken charges with hydrogens summed into heavy atoms:
elementType: O O O O O O O C C C C C C C C C C C C C C C C C C C C C C C
charge: -0.279843 -0.231200 -0.216665 -0.269412 -0.289059 -0.304099 -0.299194 -0.158103 0.017957 0.483638 -0.020049 0.149628 0.542101 0.014966 0.216545 -0.317632 -0.246329 -0.242197 -0.213528 0.203574 0.216159 0.207153 -0.099901 0.177349 0.195649 0.034918 0.203788 0.170483 0.176076 0.177226
polarizability: 3.16976963e+02 -2.45619944e+01 2.83946273e+02 -4.05375506e+00 8.33931622e-01 2.49777910e+02
1716.lowfreq: -33.3453 -7.3057 -3.0557 -0.0002 0.0006 0.0009 2.1335 11.6800 19.9146
frequency: -33.3402 11.4909 19.7429 24.4133 29.5968 32.8647 49.1378 62.3681 69.2151 81.0686 83.6442 104.9679 106.1523 115.1738 146.7350 153.6406 157.0172 160.6574 163.7627 178.1296 184.8683 194.3660 202.5931 216.1762 226.8203 238.8238 258.8025 266.5607 274.8458 298.3372 312.1049 327.1430 341.6357 347.3703 361.9125 381.6673 403.4273 424.8946 435.0464 458.0128 461.7507 490.4061 514.5327 530.7761 541.5082 557.4164 576.0260 594.4617 602.1545 632.8792 657.6130 668.2792 690.5387 708.0307 714.4083 734.9271 744.6804 754.6890 769.1839 783.2559 815.8756 832.0498 851.1494 867.8687 888.4133 896.7711 899.9327 912.6906 916.8513 930.9172 946.4746 957.2597 979.7925 984.5160 992.0770 1016.1007 1021.6330 1090.8171 1092.0408 1097.5966 1107.3838 1112.0567 1112.8502 1114.4863 1116.4597 1135.1293 1135.5260 1151.9744 1153.4088 1155.6284 1155.8416 1161.0259 1175.3836 1188.7985 1193.6963 1214.8426 1225.1813 1241.7099 1245.9051 1255.1536 1275.4385 1278.5599 1289.2880 1314.2568 1321.1905 1347.1202 1355.1434 1367.5961 1384.7813 1391.4115 1396.8334 1410.2979 1422.8312 1428.0091 1437.2699 1442.3137 1450.8857 1457.1048 1457.1336 1457.1827 1458.7435 1461.9152 1463.6495 1464.7641 1474.0546 1477.7868 1483.3602 1483.6633 1488.4668 1499.5179 1561.1344 1570.4824 1575.4649 1610.4534 1620.6153 1636.6680 2966.6332 2970.7620 2972.7851 2992.1536 2994.6360 3003.1872 3011.4435 3019.7865 3028.3723 3057.9244 3066.6010 3069.5110 3081.3954 3087.0777 3092.4493 3113.7060 3118.0885 3120.5966 3121.5978 3121.8762 3125.2778 3126.8233 3148.4828 3151.2384 3157.3964 3159.6991
redmass: 2.9200 3.8000 4.2810 5.1696 4.6291 4.0859 5.1185 4.0926 5.5881 4.0571 3.6633 4.6483 2.8285 3.7667 3.8704 1.6971 3.9470 1.2798 1.5824 2.2817 1.4676 2.1631 1.8082 2.7386 4.0711 3.9307 1.5628 2.2625 5.0313 3.3881 4.6019 4.2476 3.8835 4.4161 5.4377 5.4311 5.0042 5.1240 4.8007 3.5202 4.3756 3.8602 5.7419 5.7195 5.1002 4.9817 4.7803 4.6603 5.1520 5.1729 4.2885 5.3805 6.2107 5.7927 5.6080 3.6153 4.4728 3.8143 2.6698 3.9446 1.4779 1.6807 2.8171 3.6312 2.3225 2.2499 1.8909 3.2139 2.0689 2.3247 6.7174 1.4141 3.7631 5.8192 2.9930 3.0761 3.4258 2.8872 2.8518 2.1890 1.2421 1.2602 1.2575 1.3040 1.9766 1.8907 1.8631 1.4958 1.3401 1.4950 1.5766 1.7290 1.5055 1.8454 1.9026 1.5889 2.9413 2.9400 1.4609 1.4801 1.3888 1.1767 3.7875 1.8948 1.6214 1.6934 1.3363 5.2617 6.6939 1.2317 2.8461 2.3047 1.1759 1.0944 1.2127 1.3645 1.4595 1.0545 1.0542 1.0915 1.0695 1.0694 1.0435 1.0494 1.1052 1.0925 1.1837 1.9946 1.0555 3.0856 9.5698 7.4642 9.1870 6.6174 7.7791 9.8274 1.0322 1.0307 1.0312 1.0361 1.0659 1.0283 1.0817 1.0838 1.0595 1.1044 1.1042 1.1037 1.0950 1.0977 1.1030 1.1051 1.1060 1.1026 1.0912 1.1008 1.1005 1.1055 1.0912 1.0913 1.0899 1.0952
irintensity: 4.8079 0.6154 0.1465 0.6106 0.6004 0.5452 3.1738 1.0447 5.9305 5.1480 2.0506 0.9956 5.2293 0.2181 2.3869 1.4556 7.9249 1.0220 1.2358 4.3590 2.4997 0.3678 2.7010 1.4949 6.7898 4.1572 2.0541 5.3275 3.9131 4.3275 2.6662 8.5204 2.6082 0.7705 6.7753 1.3050 0.7395 5.6545 0.8327 1.2227 17.0991 6.1700 8.9019 15.1394 8.0144 1.6842 16.6975 5.1227 10.6308 4.9728 11.1859 2.9811 1.4796 7.4267 19.0852 6.0470 6.1497 10.9195 12.6568 10.0006 2.3686 27.7681 11.7233 6.3984 17.3176 5.5636 30.0841 9.6784 39.1427 19.5005 56.1563 7.0931 31.8301 64.8043 24.6332 53.6863 60.0297 151.2368 62.9243 10.2764 0.0875 26.2287 0.0107 17.2917 65.7214 58.0548 70.7008 46.1202 5.4486 13.7376 7.4676 93.9864 0.8928 15.9627 65.3514 10.6393 38.2913 109.7069 15.7385 7.1205 15.7192 1.4454 528.2323 59.2081 59.8275 81.4551 2.8457 17.8872 41.1963 20.5672 22.0041 2.9651 2.1091 13.0122 2.3416 20.5130 2.6535 13.2518 15.8683 12.6519 8.1683 32.1038 16.2981 11.9558 84.2983 17.3151 73.2749 74.3697 29.7137 125.7071 31.4557 14.9055 304.9027 4.1777 15.3988 148.7398 54.3942 78.4467 65.3365 15.3489 7.3109 82.2841 13.8242 9.4834 37.0267 35.1960 29.0656 22.9298 7.2011 42.6803 2.5185 30.9361 28.2307 22.2984 20.6308 16.2953 25.8987 25.3616 2.5015 2.3210 6.9428 8.0909
temp: 298.150 k
press: 1.00000 atm
elementType: 8 8 8 8 8 8 8 6 6 6 6 6 6 6 6 6 6 6 6 6 6 6 6 6 6 6 6 6 6 6 1 1 1 1 1 1 1 1 1 1 1 1 1 1 1 1 1 1 1 1 1 1 1 1 1 1
symmnumber: 1
zpe: 1165586.6 jmol-1
zpe.correction: 0.443948 hartree
zpe.thermalcorrener: 0.474070 hartree
zpe.thermalcorrenthalpy: 0.475015 hartree
zpe.thermalcorrgfe: 0.379776 hartree
zpe.sumelectzpe: -1416.336841 hartree
zpe.sumelectthermal: -1416.306719 hartree
zpe.sumelectthermalent: -1416.305775 hartree
zpe.sumelectthermalfe: -1416.401013 hartree
dipole: 0.3698 -1.7408 -3.5348
dipole: 3.9575
quadrupole: -151.8200 -147.9485 -189.5853
quadrupole: -9.1349 -13.1583 -8.7743
quadrupole: 11.2979 15.1694 -26.4674 -9.1349 -13.1583 -8.7743
hfenergy: -1416.7807894 hartree
pointgroup: C01 [X(C23H26O7)]
dipole: 0.0510008 0.5820859 -1.4431994 debye
polarizability: 316.7781943|-20.4497166|279.9299006|17.298701|-6.0501947|253.9930513 unknown
InChI: InChI=1S/C23H26O7/c1-6-30-23(25)16-10-17(24)14-11-20(28-4)21(29-5)12-15(14)22(16)13-7-8-18(26-2)19(9-13)27-3/h7-9,11-12,16,22H,6,10H2,1-5H3
charge 0 multiplicity 1
56 atoms
O  -1.009488 -3.838554 -0.864105
O  -1.763246 -0.141406 3.125594
O  -2.253396 -3.312289 1.037943
O  -2.083396 2.066128 -2.960576
O  -3.621505 2.909222 -0.597256
O  3.662936 2.144615 1.101916
O  5.85646 0.426577 0.194551
C  0.350734 -1.307245 -0.403121
C  0.019781 -2.351636 0.724271
C  -0.70706 -0.208603 -0.420833
C  -0.167205 -1.662507 2.089542
C  -1.420578 0.155464 0.755772
C  1.790181 -0.789114 -0.248122
C  -1.181777 -0.517476 2.063728
C  -1.211703 -3.185123 0.356547
C  -0.987172 0.480998 -1.615763
C  -2.389262 1.19111 0.697826
C  2.093582 0.458615 0.346152
C  2.862024 -1.598256 -0.709206
C  -1.949922 1.515667 -1.687923
C  -2.668712 1.87708 -0.494914
C  3.430045 0.888051 0.492415
C  4.200644 -1.187815 -0.54454
C  4.499378 0.046238 0.073056
C  -2.143512 -4.675175 -1.370427
C  -3.150835 -3.81315 -2.136242
C  -3.035343 3.147398 -3.281407
C  -4.355075 3.261405 0.623021
C  4.308241 3.145166 0.219101
C  6.324931 0.616251 1.588257
H  0.302283 -1.855711 -1.361962
H  0.870534 -3.058292 0.777487
H  -0.489091 -2.375434 2.866853
H  0.804919 -1.239176 2.412358
H  -0.457441 0.233197 -2.541526
H  -2.907253 1.427778 1.632472
H  1.300541 1.134733 0.681609
H  2.646418 -2.556682 -1.197481
H  5.03515 -1.809127 -0.885425
H  -2.617728 -5.177565 -0.508953
H  -1.648898 -5.415157 -2.019675
H  -2.65951 -3.27093 -2.962713
H  -3.628795 -3.081191 -1.463978
H  -3.941916 -4.455966 -2.565315
H  -2.818515 4.055346 -2.69623
H  -4.074285 2.831045 -3.095034
H  -2.872438 3.3297 -4.354987
H  -5.03677 4.070898 0.322951
H  -4.937067 2.399935 1.002474
H  -3.668524 3.620756 1.413128
H  3.639795 3.388237 -0.628545
H  5.276192 2.772278 -0.16228
H  4.456881 4.036938 0.846847
H  5.711013 1.369447 2.11372
H  6.286444 -0.345424 2.134351
H  7.368009 0.95683 1.502296
