program: Gaussian 09
title: 000270569
version: EM64L-G09RevD.01
frameworkgroup: C1[X(C18H16O2)]
method: RPBEPBE
basis: SDD
operation: Freq
keyword: #pfreq=noraman
keyword: PBEPBE/SDD
title: #p freq=noraman PBEPBE/SDD
converged: YES YES NO NO
title: Mulliken charges:
elementType: O O C C C C C C C C C C C C C C C C C C H H H H H H H H H H H H H H H H
charge: -0.282048 -0.261125 0.276216 0.285555 0.263349 -0.383013 -0.389468 -0.410207 -0.414305 -0.383069 -0.230326 -0.228323 -0.231844 -0.228182 -0.243219 -0.240651 -0.141367 -0.365052 0.210387 -0.506336 0.259503 0.257755 0.246589 0.266411 0.237648 0.229566 0.230012 0.228815 0.232129 0.232378 0.232239 0.291053 0.251000 0.229677 0.239366 0.238887
chargesum: 0.00000
title: Mulliken charges with hydrogens summed into heavy atoms:
elementType: O O C C C C C C C C C C C C C C C C C C
charge: -0.282048 -0.261125 0.276216 0.285555 0.263349 -0.123510 -0.131713 -0.163618 -0.147894 -0.145421 -0.000760 0.001689 -0.003029 0.003947 -0.010841 -0.008411 0.149686 -0.114052 0.210387 0.201595
polarizability: 3.77571699e+02 -4.38890028e+00 2.39147811e+02 -8.86243192e+00 -7.02503829e+00 1.15672769e+02
1716.lowfreq: -8.5570 -6.8159 -0.0006 -0.0006 -0.0004 1.7751 34.4295 35.7315 45.3041
frequency: 34.3754 35.7193 45.2871 53.1855 67.2209 75.9102 85.9688 100.6795 121.4628 190.2315 202.2141 217.0295 242.6688 260.9447 285.9735 292.7954 341.6378 372.6472 404.9408 408.7801 453.3102 458.8609 503.1274 576.2831 611.3919 615.0962 641.0645 647.3152 671.5070 680.4426 701.0721 705.4443 730.2432 775.2803 782.0227 851.8842 857.8217 859.0038 872.6975 897.2685 913.0616 930.8412 935.8233 978.9793 980.8226 987.7406 988.4357 989.9158 997.5562 997.8678 1014.2660 1025.5107 1029.8265 1084.1001 1085.6450 1110.6341 1112.2763 1142.6441 1147.9381 1173.9920 1174.2901 1192.3800 1194.9766 1210.3188 1242.3581 1284.9172 1300.2797 1317.1306 1323.1050 1361.2171 1373.3298 1382.0239 1421.4858 1432.2790 1435.7167 1449.5966 1463.7590 1476.7439 1485.0167 1557.6202 1577.0513 1583.3154 1599.8825 1604.9912 1609.0845 1627.8952 2998.7210 3097.0136 3102.5754 3123.5174 3125.4739 3126.7721 3131.9837 3133.7674 3143.2701 3144.2192 3145.2369 3149.6023 3152.8257 3153.8002 3166.9003 3167.7062
redmass: 4.3614 4.7594 4.4006 4.1781 4.1091 3.8569 1.2803 3.4453 4.8796 4.6260 4.4747 4.7619 4.8420 2.9514 4.5578 4.0822 3.5297 4.8656 2.8627 2.8797 4.0485 4.0262 4.1741 4.7920 6.0380 6.3955 4.7362 4.5546 5.4995 4.7464 1.6869 1.7781 3.6185 2.0533 2.1376 1.2506 1.2529 1.5165 6.0090 3.4327 1.8233 1.5031 1.5340 1.4048 1.4272 5.4293 5.4298 5.8969 1.3163 1.3198 1.1501 2.4168 2.0664 1.6196 1.6421 2.7650 1.2869 3.1551 1.4496 1.0543 1.0536 1.1339 1.1202 2.1598 1.7687 1.5955 1.9574 1.4240 1.3924 2.2036 5.8834 4.5454 1.1975 2.2762 2.2854 1.0503 1.0530 2.1945 2.4193 6.1362 5.6782 6.3476 6.6720 6.0617 7.4614 5.7774 1.0298 1.1040 1.0897 1.0904 1.0849 1.0849 1.0875 1.0877 1.1042 1.0923 1.0924 1.0906 1.0961 1.0965 1.1016 1.1016
irintensity: 1.5444 0.1691 0.2567 0.8116 0.1198 0.2533 0.6293 0.1619 1.7877 7.0095 0.1751 1.8087 0.9151 2.9943 17.6153 1.5700 5.3289 10.3904 0.1110 1.6128 3.1432 3.1420 2.5494 8.0936 0.9807 0.2457 16.4351 6.7179 16.2527 5.8859 60.6516 40.1968 9.9203 24.6920 50.6116 1.4220 1.7934 7.7644 15.5360 6.4792 20.3589 1.0597 12.0696 3.0325 5.1437 17.5201 1.2911 49.2601 2.3540 0.7437 36.6260 6.1002 13.0886 11.7491 1.5465 515.5166 14.8220 90.3884 12.2587 0.1950 0.0479 1.9107 4.2710 3.2832 109.7473 57.3434 96.2717 22.6663 18.8506 25.4187 3.5580 17.0639 30.5525 13.5823 23.0456 13.5199 18.3468 1.0072 8.4407 29.7670 1.9832 28.9739 274.0805 17.0357 141.8558 122.0946 57.6292 30.2142 12.7810 5.7564 1.7233 1.3309 0.7779 0.9064 24.8480 16.1340 17.0169 5.6035 33.0561 27.4286 33.1433 19.6350
temp: 298.150 k
press: 1.00000 atm
elementType: 8 8 6 6 6 6 6 6 6 6 6 6 6 6 6 6 6 6 6 6 1 1 1 1 1 1 1 1 1 1 1 1 1 1 1 1
symmnumber: 1
zpe: 748281.1 jmol-1
zpe.correction: 0.285005 hartree
zpe.thermalcorrener: 0.303263 hartree
zpe.thermalcorrenthalpy: 0.304207 hartree
zpe.thermalcorrgfe: 0.236355 hartree
zpe.sumelectzpe: -844.543756 hartree
zpe.sumelectthermal: -844.525498 hartree
zpe.sumelectthermalent: -844.524554 hartree
zpe.sumelectthermalfe: -844.592407 hartree
dipole: -2.3255 -0.6820 -0.3102
dipole: 2.4432
quadrupole: -101.3052 -105.0017 -117.7064
quadrupole: -3.9067 -3.5413 -3.6703
quadrupole: 6.6992 3.0027 -9.7019 -3.9067 -3.5413 -3.6703
hfenergy: -844.8287615 hartree
pointgroup: C01 [X(C18H16O2)]
dipole: 0.9285089 -0.240367 0.0636381 debye
polarizability: 376.2961094|12.7695067|235.2200711|-14.0356176|24.1678775|120.8760978 unknown
InChI: InChI=1S/C18H16O2/c1-20-18(19)14-8-13-17(15-9-4-2-5-10-15)16-11-6-3-7-12-16/h2-14H,1H3
charge 0 multiplicity 1
36 atoms
O  -5.168587 -1.802701 0.004728
O  -4.535201 0.44328 -0.179485
C  0.774517 -0.255759 0.004336
C  2.097268 -0.92903 -0.138408
C  0.753734 1.229343 0.164067
C  3.255745 -0.406432 0.506262
C  1.551684 2.05575 -0.677988
C  2.240162 -2.118706 -0.911025
C  -0.046654 1.854372 1.161207
C  -0.387583 -1.017196 -0.002494
C  4.501388 -1.059995 0.40181
C  1.526758 3.459722 -0.546083
C  3.486276 -2.769394 -1.018351
C  -0.062418 3.258898 1.300483
C  4.623881 -2.245929 -0.359175
C  0.718909 4.068197 0.443949
C  -1.744998 -0.517015 -0.040523
C  -2.854924 -1.329258 0.015086
C  -4.212246 -0.769076 -0.065427
C  -6.577682 -1.360905 -0.069314
H  3.169633 0.505906 1.106065
H  2.177788 1.590535 -1.447335
H  1.376476 -2.513553 -1.457593
H  -0.633265 1.231945 1.845513
H  -0.279641 -2.110687 -0.002373
H  5.375752 -0.646215 0.916364
H  2.13502 4.079172 -1.214497
H  3.574711 -3.676955 -1.625941
H  -0.681979 3.719529 2.077669
H  5.592556 -2.750634 -0.444497
H  0.702969 5.158621 0.549406
H  -1.913494 0.562449 -0.149571
H  -2.774185 -2.41639 0.123833
H  -7.168067 -2.285336 0.003105
H  -6.76847 -0.841231 -1.023972
H  -6.810629 -0.674227 0.762572
