program: Gaussian 09
title: 000276148
version: EM64L-G09RevD.01
frameworkgroup: C1[X(C20H25NO4)]
method: RPBEPBE
basis: SDD
operation: Freq
keyword: #p
keyword: freq=noraman
keyword: PBEPBE/SDD
title: #p freq=noraman PBEPBE/SDD
converged: YES YES NO NO
title: Mulliken charges:
elementType: O O O O N C C C C C C C C C C C C C C C C C C C C H H H H H H H H H H H H H H H H H H H H H H H H H
charge: -0.323095 -0.434443 -0.312708 -0.300022 -0.115086 -0.184736 0.369515 -0.408088 -0.574371 0.402494 -0.613401 -0.644015 -0.557533 0.576897 -0.581093 0.191797 0.131372 -0.541854 -0.405252 0.223235 -0.350088 0.176490 -0.521857 -0.533730 -0.530630 0.203237 0.213575 0.193795 0.247128 0.214272 0.206769 0.209680 0.221042 0.196914 0.227279 0.249404 0.261015 0.249898 0.243982 0.244830 0.377993 0.243197 0.224804 0.225148 0.235347 0.224289 0.246585 0.225284 0.255902 0.218833
chargesum: 0.00000
title: Mulliken charges with hydrogens summed into heavy atoms:
elementType: O O O O N C C C C C C C C C C C C C C C C C C C C
charge: -0.323095 -0.056450 -0.312708 -0.300022 -0.115086 0.018501 0.369515 -0.000718 -0.112971 0.402494 -0.196951 0.001220 -0.308129 0.576897 -0.320078 0.191797 0.131372 -0.291956 -0.161271 0.223235 -0.105258 0.176490 0.171291 0.172491 0.169388
polarizability: 2.32917554e+02 -6.94088330e+00 2.71754678e+02 -2.56723695e+01 -2.15234882e+00 1.97723175e+02
1716.lowfreq: -9.7505 -3.8227 -0.0003 0.0004 0.0007 4.7081 10.4652 16.9508 29.3356
frequency: 5.6377 16.7734 29.2188 53.7338 61.5843 63.7551 94.2597 97.5533 114.9614 122.4797 140.5809 155.5518 172.5431 173.3057 181.9865 196.8145 210.8737 218.5097 237.3353 250.4261 267.3083 279.7791 295.2045 311.7280 336.3110 343.1129 345.3024 367.5345 387.8345 419.7286 429.4165 449.8141 458.9410 470.6841 488.1293 494.6230 512.0322 536.5333 557.3149 570.7125 605.0778 642.5704 679.3677 686.9003 706.4680 710.9401 729.4649 740.7958 744.9369 787.5001 817.3373 835.4150 857.0080 858.5359 877.6584 900.6499 912.3504 942.4534 944.8079 951.8963 958.1609 972.0887 988.9689 1000.1691 1042.9332 1070.7243 1087.7940 1092.7786 1110.3703 1113.2719 1114.3042 1117.3387 1134.6915 1136.9577 1153.5079 1154.5568 1155.2237 1165.5880 1172.5438 1179.0075 1192.2151 1207.0623 1213.5358 1222.0320 1229.2594 1243.5104 1257.7413 1265.3319 1278.0263 1294.9634 1328.4918 1340.4437 1346.6254 1366.2022 1376.9978 1399.6816 1411.5717 1422.2625 1434.6703 1440.8292 1441.3703 1447.3237 1448.6727 1456.9869 1458.6352 1464.2411 1466.5527 1469.3134 1475.3488 1477.7629 1479.2094 1484.8609 1486.6966 1487.9567 1507.0225 1572.8540 1605.1720 1612.3712 1632.6574 2835.1186 2847.3097 2860.6480 2962.5855 2966.1246 2970.0493 2985.7332 2989.5881 3012.4160 3014.2514 3042.2071 3047.5529 3051.0187 3061.7418 3067.7919 3068.6243 3115.7185 3117.8545 3125.0532 3133.5834 3142.6695 3144.2603 3151.3175 3165.4343 3515.1192
redmass: 4.3922 5.4844 3.9647 4.0923 3.7690 3.0990 4.3783 3.0357 3.3358 3.7154 3.5250 2.3429 1.1572 1.5253 2.5853 1.8904 1.3382 1.5131 2.9699 3.7771 3.2175 3.0525 3.6010 3.6265 2.9960 4.4951 3.6744 4.2594 3.6114 4.7555 3.0642 3.0249 4.5358 3.9629 1.1278 3.5125 4.3115 4.1464 3.7513 4.9056 4.5240 4.9759 5.4638 3.8892 4.7153 5.6566 3.4631 3.9707 3.5054 2.4340 2.5378 1.6953 1.7457 2.8797 1.4901 1.6417 3.5355 1.7711 2.5310 4.0674 2.0701 3.5289 3.5864 3.2195 1.8486 1.9299 3.2134 3.5163 1.3731 1.2414 1.2429 1.2566 2.0929 1.6653 1.3518 1.3958 1.4151 1.4030 1.7148 1.3780 1.7831 1.3257 1.4530 1.8341 1.9962 2.3035 1.7619 1.8382 1.9194 2.7354 1.5698 1.3439 1.6047 4.1873 1.7493 2.2240 4.4431 1.1764 1.2172 1.3705 1.2436 1.7386 1.6157 1.0550 1.0693 1.0510 1.0708 1.0878 1.1074 1.0817 1.0749 2.6589 1.0955 1.0640 3.1284 7.3788 7.8419 6.7984 6.8611 1.0811 1.0666 1.0623 1.0326 1.0307 1.0315 1.0618 1.0597 1.0725 1.0868 1.1017 1.1006 1.1042 1.1044 1.1028 1.1004 1.1023 1.1030 1.0994 1.0906 1.0877 1.0914 1.0920 1.0967 1.0645
irintensity: 0.5412 0.4415 0.7708 0.1969 1.8423 8.0285 0.3520 7.2728 0.9882 1.5292 3.2206 0.9613 0.0811 0.2946 0.2356 4.3801 3.0187 7.0167 1.0074 7.8505 3.1071 2.7960 3.3164 5.1368 0.9369 1.3205 0.8500 0.2519 0.2105 2.3308 3.3538 5.2541 8.9957 22.7174 125.4406 6.1952 6.9873 2.1841 7.5553 6.9039 3.2307 5.8259 6.6824 6.5947 5.3519 12.7923 1.4687 15.4101 4.4273 23.2701 51.4348 12.6184 7.4333 19.5123 20.9184 21.9822 5.2738 12.1028 4.9454 59.5777 3.6630 10.9474 38.7902 34.0932 35.9520 10.4714 64.9028 37.4830 11.9225 14.3011 1.3764 0.1383 40.2976 7.3808 2.5412 5.3428 22.5769 23.5751 85.2437 41.9733 54.2814 10.8563 18.9012 53.2603 41.3731 68.2437 54.9485 16.4181 52.0719 92.4589 2.7644 13.1361 14.6892 4.3658 34.0218 21.9807 4.4839 1.0716 7.8197 14.4919 13.0916 10.5130 13.5209 11.1535 5.8532 11.3046 5.7259 17.4120 70.7570 7.9131 8.8751 110.1623 10.1537 32.3023 151.1497 4.3921 17.0419 1.4110 8.3316 50.8691 48.9405 295.5259 56.3419 62.6843 81.6229 13.6334 54.4340 39.4061 70.8959 29.2647 28.9024 47.2431 28.6505 26.2661 31.9591 27.0797 25.4034 25.6041 8.6367 5.9655 9.0685 4.0999 9.3643 80.8192
temp: 298.150 k
press: 1.00000 atm
elementType: 8 8 8 8 7 6 6 6 6 6 6 6 6 6 6 6 6 6 6 6 6 6 6 6 6 1 1 1 1 1 1 1 1 1 1 1 1 1 1 1 1 1 1 1 1 1 1 1 1 1
symmnumber: 1
zpe: 1076120.4 jmol-1
zpe.correction: 0.409873 hartree
zpe.thermalcorrener: 0.435110 hartree
zpe.thermalcorrenthalpy: 0.436054 hartree
zpe.thermalcorrgfe: 0.352631 hartree
zpe.sumelectzpe: -1130.838562 hartree
zpe.sumelectthermal: -1130.813325 hartree
zpe.sumelectthermalent: -1130.812381 hartree
zpe.sumelectthermalfe: -1130.895804 hartree
dipole: 1.9881 0.7630 -2.6886
dipole: 3.4298
quadrupole: -140.3686 -135.3297 -144.8047
quadrupole: 1.3764 -12.1930 5.5048
quadrupole: -0.2009 4.8379 -4.6370 1.3764 -12.1930 5.5048
hfenergy: -1131.2484351 hartree
pointgroup: C01 [X(C20H25N1O4)]
dipole: -0.6017772 0.3131852 1.166438 debye
polarizability: 229.0430112|14.8232404|268.0503591|-27.8098159|9.2885168|205.3020373 unknown
InChI: InChI=1S/C20H25NO4/c1-21-8-7-14-11-17(22)19(24-3)12-15(14)16(21)9-13-5-6-18(23-2)20(10-13)25-4/h5-6,10-12,16,22H,7-9H2,1-4H3
charge 0 multiplicity 1
50 atoms
O  -3.467534 -2.343608 0.979584
O  -3.187973 -2.536287 -1.67879
O  2.342397 -2.681796 0.0904
O  4.336949 -1.115895 -1.376902
N  -0.47606 3.139638 0.156896
C  -0.901811 2.01116 1.029014
C  -1.549365 0.848908 0.273809
C  -1.030967 3.176468 -1.213114
C  -0.780655 1.832723 -1.919565
C  -1.446185 0.71848 -1.132648
C  0.33146 1.505946 1.879137
C  -0.537538 4.441329 0.840257
C  -2.226811 -0.150718 1.022208
C  1.403368 0.809537 1.060618
C  -1.999436 -0.415271 -1.779144
C  -2.767364 -1.273545 0.374621
C  -2.645833 -1.415077 -1.037384
C  1.431514 -0.603617 0.962107
C  2.368606 1.552595 0.331596
C  2.381252 -1.263954 0.156805
C  3.342314 0.898743 -0.454631
C  3.365778 -0.510208 -0.542894
C  -3.635655 -2.306631 2.431194
C  1.93232 -3.199741 -1.236334
C  5.256019 -2.049695 -0.6869
H  -1.650756 2.380422 1.775937
H  -0.520186 3.994938 -1.756092
H  -2.12833 3.401818 -1.226663
H  0.312332 1.666444 -1.981333
H  -1.1750 1.867342 -2.952056
H  -0.053339 0.823587 2.661193
H  0.755187 2.3860 2.399985
H  0.006805 4.397532 1.800986
H  -1.582718 4.778934 1.057772
H  -0.053287 5.21479 0.216572
H  -2.323546 -0.037599 2.107844
H  -1.937067 -0.526835 -2.866553
H  0.693097 -1.218963 1.487777
H  2.343598 2.645773 0.37649
H  4.101714 1.461872 -1.007196
H  -3.614615 -3.111156 -0.989122
H  -4.192636 -3.219745 2.687619
H  -4.214799 -1.415253 2.740835
H  -2.654188 -2.310137 2.943798
H  0.902885 -2.868508 -1.472411
H  1.963268 -4.296795 -1.148246
H  2.627096 -2.855849 -2.024816
H  5.904614 -2.458787 -1.476897
H  4.694515 -2.857805 -0.185331
H  5.867467 -1.5014 0.055366
