program: Gaussian 09
title: 000276129
version: EM64L-G09RevD.01
frameworkgroup: C1[X(C9H13NO2)]
method: RPBEPBE
basis: SDD
operation: Freq
keyword: #p
keyword: freq=noraman
keyword: PBEPBE/SDD
title: #p freq=noraman PBEPBE/SDD
converged: NO NO NO NO
title: Mulliken charges:
elementType: O O N C C C C C C C C C H H H H H H H H H H H H H
charge: -0.169867 -0.210448 -0.258551 -0.010873 -0.399554 -0.428651 -0.431195 -0.421760 -0.480288 -0.492766 0.182185 0.187708 0.223022 0.210907 0.210968 0.216747 0.209658 0.230595 0.209118 0.211330 0.228723 0.236311 0.247998 0.259272 0.239411
chargesum: 0.00000
title: Mulliken charges with hydrogens summed into heavy atoms:
elementType: O O N C C C C C C C C C
charge: -0.169867 -0.210448 -0.258551 0.212148 0.022322 -0.002246 0.008518 0.018293 0.004021 0.005917 0.182185 0.187708
polarizability: 1.20353986e+02 -9.38877354e-01 1.10914617e+02 1.53408427e+00 -2.43034112e-01 7.77211421e+01
1716.lowfreq: -15.1226 -10.2768 -0.0009 -0.0007 -0.0006 7.3842 63.3770 67.8250 103.1721
frequency: 63.3726 67.6921 103.1453 169.6857 243.6519 251.8641 289.9113 376.4983 385.5959 415.6911 446.6416 465.0604 510.7950 515.0608 575.7945 592.5111 617.8230 652.2234 812.7849 824.3795 846.4784 884.2411 893.1237 935.4855 980.5492 983.5151 1009.0626 1047.9383 1072.1487 1087.2709 1110.0489 1121.5786 1141.0579 1167.0286 1179.9917 1201.4835 1239.8758 1247.1349 1251.8981 1272.7767 1297.8648 1318.7069 1326.2992 1340.8932 1344.7772 1346.7977 1350.5237 1369.3238 1441.6106 1443.3073 1455.0157 1468.3424 1478.3256 1479.0679 1585.7049 1650.6184 2936.4873 2975.2933 2982.2234 2987.0245 2988.5134 2991.0486 2999.9076 3043.4977 3050.2667 3051.1492 3056.7442 3064.7679 3083.2178
redmass: 4.6666 2.9278 2.6321 4.7589 2.8391 3.4323 1.9163 3.7546 4.5858 3.0016 3.6457 6.3320 2.1654 2.7489 3.2791 3.1454 3.4018 3.8531 2.3339 1.7391 1.5902 2.0107 2.2803 2.4126 2.4187 2.0477 1.9865 2.2312 1.8795 1.8830 1.5243 2.8366 1.8734 1.7659 1.9152 2.3722 1.6765 1.6375 1.2648 1.5829 1.2764 1.4116 1.4377 1.3978 1.4576 1.4036 1.4130 1.7237 1.0833 1.0799 1.0904 1.0879 1.0867 1.0889 11.8422 11.2934 1.0834 1.0677 1.0618 1.0608 1.0643 1.0613 1.0641 1.0996 1.0970 1.1013 1.1015 1.1013 1.0945
irintensity: 0.5418 3.6810 0.5782 0.8944 0.9365 0.5858 0.4677 3.8736 2.3179 2.8979 2.5455 17.8384 0.2895 5.2507 5.4124 2.2594 0.7940 10.5862 12.5552 12.8960 2.7798 7.7491 1.2141 8.1234 10.6583 3.7550 19.8911 64.7394 28.9460 22.9859 8.5584 30.4690 44.7480 82.1289 6.1157 5.8657 60.0902 197.5620 0.4314 173.3877 5.5718 2.5873 2.9057 0.7173 6.2965 12.0971 3.5182 41.9453 5.3334 11.0560 5.3492 14.8695 9.2564 14.4297 83.9983 292.3789 24.5904 7.1929 1.6331 45.8896 38.9229 40.2206 9.7271 20.2409 26.9459 29.4416 71.6532 37.4701 18.8966
temp: 298.150 k
press: 1.00000 atm
elementType: 8 8 7 6 6 6 6 6 6 6 6 6 1 1 1 1 1 1 1 1 1 1 1 1 1
symmnumber: 1
zpe: 550044.1 jmol-1
zpe.correction: 0.209501 hartree
zpe.thermalcorrener: 0.220075 hartree
zpe.thermalcorrenthalpy: 0.221020 hartree
zpe.thermalcorrgfe: 0.173109 hartree
zpe.sumelectzpe: -555.050564 hartree
zpe.sumelectthermal: -555.039989 hartree
zpe.sumelectthermalent: -555.039045 hartree
zpe.sumelectthermalfe: -555.086956 hartree
dipole: 0.0367 -7.0869 0.0081
dipole: 7.0870
quadrupole: -63.1733 -85.4513 -70.8056
quadrupole: 0.0491 -3.1012 -0.2043
quadrupole: 9.9701 -12.3079 2.3378 0.0491 -3.1012 -0.2043
hfenergy: -555.2600649 hartree
pointgroup: C01 [X(C9H13N1O2)]
dipole: 0.0423929 -2.7859494 0.1043572 debye
dipolederiv: -0.5629475 -0.0242909 0.0053198 -0.3340397 -0.8409993 -0.2756061 -0.0220608 -0.2622064 -0.3632909 -0.5763499 0.0038816 -0.0069145 0.3134414 -0.9174764 0.2978402 -0.1286537 0.2919945 -0.4296034 -1.7762991 0.0507164 -0.34685 -0.0290774 -0.8626336 0.0234067 -0.2542178 -0.0085156 -0.3334335 0.1042969 -0.0116242 -0.0631857 0.0037537 0.6191381 -0.0950733 0.0307519 -0.1130959 0.3286212 -0.0192006 0.0079432 0.020689 -0.0034906 0.0143386 -0.0084755 -0.0002663 0.0049335 0.1085278 -0.0350989 -0.0050244 0.0087232 0.0352597 0.0280952 -0.0218583 0.0317455 0.0143422 0.1405478 0.0409623 -0.0284284 -0.0065707 -0.0538571 0.1006048 -0.0018669 0.0181218 -0.0168751 0.1656564 0.0378774 0.0335147 0.0196674 0.0189288 0.0360434 0.0386011 -0.0102992 0.0026315 0.1343476 -0.228737 0.1171764 0.0639228 0.1066688 -0.047501 -0.0471277 0.1131284 -0.1360523 0.0579144 -0.2708701 -0.1375026 0.0216878 -0.0543265 0.0232146 0.015526 -0.0246733 0.0283986 0.0966274 1.5664094 0.2132673 0.0927957 0.5841406 0.953056 0.5060584 0.005696 0.4854483 0.3074792 1.5310886 -0.2392327 0.2671188 -0.5583894 1.0212956 -0.4808935 0.3166744 -0.4323649 0.3559529 0.0501345 0.0124498 -0.0159395 -0.0016954 -0.0657843 0.0046549 -0.0066282 0.0703406 -0.1689897 0.024488 -0.0012581 -0.0347952 -0.0010242 0.0934408 0.047771 -0.0143099 -0.0070918 -0.1480744 0.050695 -0.025699 -0.002409 -0.007698 -0.1907502 0.0278622 0.0059131 0.0507034 0.0736732 0.0560624 0.0325285 -0.0147578 0.0122207 -0.1628057 0.0563463 -0.0078493 0.0827815 0.0585324 0.0338119 -0.0008726 0.0204938 0.0090981 0.0850905 0.012097 -0.0069204 -0.0446457 -0.1560043 -0.1486156 0.0938153 0.0596932 0.1012235 -0.0009086 -0.0295916 0.0951544 -0.0520991 0.0529961 0.0811375 -0.0275585 0.0149315 -0.014631 0.0202726 0.0295342 -0.0605254 0.0633315 -0.1604796 0.0825906 0.0235157 -0.0551274 0.0275289 0.0393521 -0.0240291 0.0115021 0.0010899 -0.1654348 -0.1607854 -0.1129423 -0.0056001 -0.1229707 -0.0115767 0.0037364 -0.0318114 -0.0154778 0.0808288 0.0680874 0.0420866 0.0004333 0.0318834 0.0557463 0.0115073 0.0251649 0.0568522 -0.0857671 -0.0360332 -0.0525336 -0.0554729 -0.0722257 -0.0042606 -0.0454052 -0.0998311 -0.0436146 0.0620683 0.0231707 0.0526041 0.0456959 0.069377 -0.034381 -0.0332702 0.0833632 -0.0373514 0.0736472 0.0641246 -0.0165324 -0.0335496 -0.0600989 0.0493889 -0.011744 -0.069169 0.0165431 -0.086343 unknown
polarizability: 119.9891012|-0.6738367|110.8358106|4.3331061|-1.4380276|78.1648329 unknown
InChI: InChI=1S/C9H13NO2/c11-8-5-1-3-7-4-2-6-9(12)10(7)8/h7H,1-6H2
charge 0 multiplicity 1
25 atoms
O  1.185689 2.185309 0.692226
O  -1.142914 2.12457 -0.876377
N  -0.013039 0.265021 0.011983
C  0.013072 -1.223871 0.297952
C  1.256291 -1.870373 -0.346475
C  -1.29194 -1.912564 -0.134649
C  2.54203 -1.21858 0.194577
C  -2.506912 -1.135074 0.39879
C  2.516546 0.301091 -0.077028
C  -2.541512 0.238961 -0.29139
C  1.201711 1.008545 0.264598
C  -1.192438 0.961554 -0.400947
H  0.101095 -1.336943 1.401389
H  1.198629 -1.757097 -1.446957
H  1.243438 -2.954429 -0.123881
H  -1.272213 -2.94753 0.253832
H  -1.340035 -1.977627 -1.240171
H  3.439822 -1.667649 -0.268409
H  2.616784 -1.40287 1.284438
H  -2.418157 -1.01577 1.496431
H  -3.448903 -1.681199 0.209525
H  2.679225 0.48199 -1.160407
H  3.319154 0.831015 0.461902
H  -3.222192 0.944904 0.218194
H  -2.925832 0.141814 -1.325345
