program: Gaussian 09
title: 000276131
version: EM64L-G09RevD.01
frameworkgroup: C1[X(C14H18O3)]
method: RPBEPBE
basis: SDD
operation: Freq
keyword: #pfreq=noraman
keyword: PBEPBE/SDD
title: #p freq=noraman PBEPBE/SDD
converged: YES YES NO NO
title: Mulliken charges:
elementType: O O O C C C C C C C C C C C C C C H H H H H H H H H H H H H H H H H H
charge: -0.191465 -0.170479 -0.163630 0.180383 0.290016 -0.253438 0.224968 -0.256255 -0.597993 -0.583475 -0.432578 -0.540058 -0.456338 -0.747351 -0.740579 0.178450 0.173020 0.275379 0.279733 0.249686 0.219792 0.217511 0.251998 0.202791 0.195900 0.227960 0.219339 0.214342 0.209656 0.214625 0.232683 0.226750 0.221278 0.215884 0.211491
chargesum: 0.00000
title: Mulliken charges with hydrogens summed into heavy atoms:
elementType: O O O C C C C C C C C C C C C C C
charge: -0.191465 -0.170479 -0.163630 0.180383 0.290016 0.021942 0.224968 0.023478 -0.128515 -0.113966 -0.033887 -0.092759 -0.032339 -0.073292 -0.091926 0.178450 0.173020
polarizability: 1.47118153e+02 -1.16725625e+01 1.63598483e+02 -2.93299170e+00 -6.46080768e-01 1.25372087e+02
1716.lowfreq: -12.1589 -5.9147 -0.0010 -0.0004 0.0001 12.7601 27.4408 52.4064 71.9251
frequency: 27.3650 52.3059 71.8790 120.4488 133.5993 170.6676 213.0720 219.2679 246.2533 255.9071 273.2227 292.9074 318.1182 351.8610 364.3126 373.1785 399.7062 423.1477 469.0601 473.8565 503.3641 533.5198 578.6510 580.0507 607.0971 621.9465 650.7682 670.3054 745.1998 782.8955 801.0576 812.7849 857.4234 867.8521 872.1739 886.7642 924.8979 931.5139 948.6188 955.4273 967.6745 993.4696 1017.2314 1030.3830 1057.5448 1077.5986 1105.4557 1109.6135 1120.5122 1142.2327 1163.5924 1173.0091 1179.1489 1193.3325 1197.7166 1205.9067 1216.3257 1243.9050 1260.3205 1266.3575 1288.2937 1298.6514 1330.8376 1337.1968 1343.9666 1350.8511 1364.8263 1376.0515 1397.1085 1455.0216 1456.0271 1463.7342 1466.7497 1468.2893 1477.3199 1479.0778 1482.5247 1491.9022 1667.8866 1693.0447 1765.5696 2942.9803 2965.1484 2967.4914 2970.8121 2972.6424 2975.3716 2985.9487 3001.5131 3013.1086 3027.2467 3030.1411 3048.3219 3051.2683 3060.5128 3063.4248 3068.9289 3072.2202 3077.9607
redmass: 7.7037 4.2029 4.6005 2.7908 13.7039 2.1387 1.4637 2.8402 1.0895 2.3309 2.4162 2.1788 2.4494 1.9919 3.5394 5.8849 3.3051 3.9753 3.3498 2.9333 3.9860 3.6981 3.5753 8.8826 3.1419 3.8785 4.8691 6.2932 4.2164 3.4955 2.4963 5.8404 1.4959 2.5185 4.1303 2.3706 1.5763 2.1080 2.4180 2.4081 1.9510 1.3658 2.2195 1.6949 2.1340 1.8151 2.8851 2.3403 1.5797 3.0229 1.4846 1.5196 2.3075 1.6796 1.3747 1.9355 1.5298 1.5574 1.4744 1.3924 1.8321 1.5308 1.4294 1.4847 1.5168 1.5574 2.1084 1.1978 1.2055 1.0715 1.0879 1.0667 1.0714 1.0837 1.0825 1.0616 1.0635 1.0677 7.6824 12.6444 12.6294 1.0638 1.0590 1.0631 1.0434 1.0621 1.0378 1.0718 1.0859 1.0834 1.0981 1.0855 1.1029 1.0958 1.0931 1.0995 1.0988 1.0987 1.0989
irintensity: 0.7559 2.0649 1.0703 1.1697 2.4844 0.6892 0.5739 0.3044 0.1332 0.2368 2.7056 2.5184 1.1281 0.8406 3.1889 6.3863 4.5183 1.3801 1.5265 5.9098 2.7208 25.7520 4.1357 3.3688 4.3713 0.6283 2.6810 3.1809 6.2721 2.2381 4.0117 86.3629 8.2067 2.2648 185.3260 9.6355 1.1115 11.4198 19.9956 14.3206 11.6515 2.2115 5.4088 0.5989 4.7680 22.9253 93.2410 39.1074 5.9915 1.8818 8.9430 21.4163 6.2490 14.1021 2.8013 1.6701 0.9938 2.3973 1.7143 0.2039 7.3123 12.0163 2.7735 2.9189 1.4824 7.1335 2.0861 18.1785 12.2603 7.5729 0.2175 10.4687 9.0993 1.7603 7.1648 11.9384 26.2800 15.6554 2.9419 410.8057 81.9373 33.2202 25.3241 28.4470 56.3769 20.4798 31.7698 15.6516 33.4831 10.0892 48.5795 22.0440 51.4424 12.9871 7.5669 8.2263 62.9166 37.5484 36.3682
temp: 298.150 k
press: 1.00000 atm
elementType: 8 8 8 6 6 6 6 6 6 6 6 6 6 6 6 6 6 1 1 1 1 1 1 1 1 1 1 1 1 1 1 1 1 1 1
symmnumber: 1
zpe: 764735.3 jmol-1
zpe.correction: 0.291272 hartree
zpe.thermalcorrener: 0.306727 hartree
zpe.thermalcorrenthalpy: 0.307671 hartree
zpe.thermalcorrgfe: 0.248949 hartree
zpe.sumelectzpe: -768.688285 hartree
zpe.sumelectthermal: -768.672831 hartree
zpe.sumelectthermalent: -768.671886 hartree
zpe.sumelectthermalfe: -768.730609 hartree
dipole: 2.5313 0.7706 4.7756
dipole: 5.4597
quadrupole: -104.6505 -109.0487 -101.6703
quadrupole: 2.3912 -13.0503 -2.4463
quadrupole: 0.4727 -3.9256 3.4529 2.3912 -13.0503 -2.4463
hfenergy: -768.9795572 hartree
pointgroup: C01 [X(C14H18O3)]
dipole: 1.0006784 -0.2633392 -1.8823415 debye
polarizability: 145.9636546|10.7555832|164.7738058|2.7803694|-0.8219966|125.3512631 unknown
InChI: InChI=1S/C14H18O3/c1-14(2)5-3-4-8-6-9-10(7-11(8)14)13(16)17-12(9)15/h9-10H,3-7H2,1-2H3
charge 0 multiplicity 1
35 atoms
O  -2.336088 0.355436 1.219271
O  -1.622616 2.552783 0.899026
O  -2.76301 -1.920012 0.933897
C  2.24906 0.673574 0.083223
C  0.960192 0.157286 -0.581003
C  -1.453929 0.912431 -0.981704
C  0.576837 -1.156566 -0.576904
C  -1.865629 -0.580597 -0.979422
C  0.054603 1.148684 -1.309004
C  -0.690801 -1.541776 -1.330986
C  3.156238 -0.529131 0.488014
C  1.337312 -2.254834 0.145306
C  2.368545 -1.683245 1.141479
C  1.897313 1.52643 1.339472
C  3.048335 1.56035 -0.917661
C  -1.782185 1.425465 0.424989
C  -2.372487 -0.859638 0.440474
H  -2.062817 1.503468 -1.690629
H  -2.70926 -0.773519 -1.66814
H  0.303486 2.193751 -1.055473
H  0.176247 1.051249 -2.407638
H  -0.527444 -1.486438 -2.427039
H  -0.995436 -2.578478 -1.100554
H  3.948206 -0.162817 1.170172
H  3.665534 -0.915767 -0.418939
H  0.616134 -2.911788 0.672673
H  1.846633 -2.905576 -0.598557
H  1.843442 -1.317242 2.044913
H  3.059353 -2.480646 1.474283
H  2.815498 1.976684 1.761947
H  1.199274 2.349491 1.09954
H  1.422884 0.910094 2.123995
H  4.010813 1.861583 -0.462803
H  3.270189 1.008034 -1.849959
H  2.506175 2.485877 -1.183759
