program: Gaussian 09
title: 000270565
version: EM64L-G09RevD.01
frameworkgroup: C1[X(C18H18O)]
method: RPBEPBE
basis: SDD
operation: Freq
keyword: #pfreq=noraman
keyword: PBEPBE/SDD
title: #p freq=noraman PBEPBE/SDD
converged: YES YES NO NO
title: Mulliken charges:
elementType: O C C C C C C C C C C C C C C C C C C H H H H H H H H H H H H H H H H H H
charge: -0.227901 -0.421865 0.312589 0.304996 -0.374527 0.175328 0.167733 -0.357246 -0.585903 -0.449086 -0.400782 -0.397144 0.340834 -0.387099 -0.238785 -0.691608 -0.235713 0.083053 -0.794044 0.246996 0.199929 0.203450 0.217498 0.215330 0.255023 0.244232 0.243748 0.242652 0.279010 0.227563 0.206962 0.205918 0.221818 0.228421 0.238569 0.237561 0.262489
chargesum: 0.00000
title: Mulliken charges with hydrogens summed into heavy atoms:
elementType: O C C C C C C C C C C C C C C C C C C
charge: -0.227901 -0.174869 0.312589 0.304996 0.028852 0.175328 0.167733 0.075583 -0.330880 -0.204854 -0.157034 -0.154491 0.340834 -0.108090 -0.011222 -0.056910 -0.007292 0.083053 -0.055425
polarizability: 3.16269893e+02 -1.10581106e+01 1.88160932e+02 -7.32039805e+00 -3.18845040e+01 1.21769532e+02
1716.lowfreq: -13.4713 -1.6259 0.0001 0.0003 0.0006 3.6249 39.7029 45.9755 63.4259
frequency: 39.6483 45.8858 63.4238 64.1451 76.1480 127.3648 133.8266 147.8258 163.9188 208.1200 214.5064 225.9471 240.3279 285.8221 311.0581 320.0115 409.5162 417.7328 450.0955 454.1032 493.8388 533.3532 543.2644 559.9780 583.6087 593.9544 623.6090 668.5182 690.7335 723.8951 737.3681 752.1949 769.2465 792.9783 804.6437 839.9957 864.0235 875.1239 891.4304 901.2012 920.9108 944.5074 951.5133 987.9836 995.6260 996.6637 1004.7703 1024.1372 1026.6376 1053.8499 1070.2562 1089.0389 1093.3166 1112.4588 1129.5379 1167.4918 1175.2561 1190.0422 1200.4785 1217.2708 1237.3587 1244.9334 1278.9028 1290.6609 1299.1963 1307.9318 1313.5618 1359.2810 1366.0423 1378.0420 1389.8670 1390.4117 1437.7937 1444.4379 1448.8125 1458.8064 1462.9787 1463.9128 1475.5489 1477.9075 1486.6827 1488.0122 1562.7672 1589.7338 1596.9616 1618.8339 1621.6503 2951.1674 2969.2570 2972.2624 2984.3412 2986.6629 3010.6432 3038.4596 3068.7583 3069.3928 3074.1269 3122.0361 3124.8402 3130.0284 3134.4297 3136.2431 3143.3466 3160.5172 3162.4058
redmass: 3.5220 4.2458 4.7990 3.8429 1.6360 4.4130 4.0968 1.0517 3.4945 2.6299 3.3902 2.0236 1.6452 3.7188 5.6062 4.5102 3.4542 2.9942 3.0516 4.2945 5.9911 4.6835 3.3657 4.1593 4.0514 4.4161 3.1770 4.8039 3.8402 4.7337 1.2331 1.4486 4.0508 2.6269 2.7122 2.2421 1.4320 1.4464 1.7728 1.6818 1.7492 2.0266 1.4370 1.3349 6.0728 1.3828 2.5708 2.1435 1.8169 2.5119 1.9723 2.0457 1.6327 1.8497 1.5068 1.2534 1.3543 1.6403 1.6869 1.9735 1.7016 1.4523 2.0365 1.4330 1.4847 1.4855 1.8429 1.5257 1.4277 4.3795 4.0692 1.2197 4.4853 1.9340 1.2890 2.3390 1.0717 1.1468 1.0523 1.0431 1.2021 2.7740 6.9932 6.7368 7.9011 7.1725 7.0980 1.0759 1.0555 1.0451 1.0375 1.0599 1.0999 1.1022 1.0970 1.1016 1.0989 1.0860 1.0991 1.0890 1.0895 1.0903 1.0945 1.0958 1.1001
irintensity: 0.8051 1.0183 1.3827 2.3563 0.0573 1.3302 0.9194 0.6031 0.0375 1.2821 3.7319 2.5672 1.0618 0.4854 2.7334 0.1675 0.7321 6.4153 1.5182 0.3279 10.1146 0.2905 0.4722 1.4464 8.2352 8.6211 5.4540 7.4365 3.0271 0.3156 8.9245 75.0698 5.5167 12.6063 4.5415 0.7060 30.9226 0.2752 0.6210 4.6270 14.1872 40.0990 3.2285 0.0285 5.7406 1.3275 2.4178 3.3286 0.5800 0.4581 2.3302 3.3012 0.9873 4.8777 15.4086 7.9275 5.5510 2.7281 1.7577 14.3987 61.9527 16.6585 155.7465 75.2980 6.6553 8.4446 43.8494 0.2830 44.3273 16.2025 23.1179 12.7535 3.1863 31.4048 20.4247 0.9757 16.7297 12.6648 2.0466 11.9356 7.2080 15.9218 167.5363 0.5629 121.4089 1.0415 30.5769 7.8972 22.4613 56.9958 3.7449 36.5362 10.2976 7.0481 14.2259 67.8627 40.4851 4.1181 22.2198 3.8193 10.4184 2.8796 28.2251 4.3578 42.0735
temp: 298.150 k
press: 1.00000 atm
elementType: 8 6 6 6 6 6 6 6 6 6 6 6 6 6 6 6 6 6 6 1 1 1 1 1 1 1 1 1 1 1 1 1 1 1 1 1 1
symmnumber: 1
zpe: 799847.6 jmol-1
zpe.correction: 0.304646 hartree
zpe.thermalcorrener: 0.321826 hartree
zpe.thermalcorrenthalpy: 0.322770 hartree
zpe.thermalcorrgfe: 0.259051 hartree
zpe.sumelectzpe: -770.617658 hartree
zpe.sumelectthermal: -770.600478 hartree
zpe.sumelectthermalent: -770.599534 hartree
zpe.sumelectthermalfe: -770.663252 hartree
dipole: 3.7655 2.2507 -1.2908
dipole: 4.5728
quadrupole: -122.9177 -105.9860 -112.5196
quadrupole: -11.2238 5.1316 -6.1682
quadrupole: -9.1099 7.8218 1.2882 -11.2238 5.1316 -6.1682
hfenergy: -770.9223039 hartree
pointgroup: C01 [X(C18H18O1)]
dipole: 1.4703022 0.9274556 -0.4634251 debye
polarizability: 316.8392257|-7.7641025|189.2050704|-3.7607877|-30.5941289|120.1560608 unknown
InChI: InChI=1S/C18H18O/c1-3-6-14-15-7-4-5-8-16(15)17-10-9-13(12(2)19)11-18(14)17/h4-5,7-11,14H,3,6H2,1-2H3
charge 0 multiplicity 1
37 atoms
O  -4.967615 -1.096978 0.369576
C  0.83981 0.942312 -1.008213
C  -0.352306 0.12488 -0.505343
C  2.024048 0.067254 -0.592563
C  0.896801 2.40745 -0.475808
C  0.095622 -1.0813 0.116536
C  1.567046 -1.116889 0.062717
C  0.967889 2.534775 1.062181
C  -1.720977 0.413293 -0.594191
C  3.39925 0.28961 -0.778981
C  -0.837755 -2.000701 0.651697
C  2.485848 -2.082787 0.531586
C  -2.668969 -0.505734 -0.056839
C  -2.210601 -1.706085 0.56152
C  4.322281 -0.677654 -0.306882
C  1.011376 4.008072 1.522089
C  3.868008 -1.853935 0.342233
C  -4.148394 -0.260489 -0.118091
C  -4.659118 1.017528 -0.780515
H  0.800918 1.001107 -2.117604
H  0.004732 2.951813 -0.848315
H  1.776332 2.910596 -0.927126
H  1.864433 2.002216 1.434018
H  0.092401 2.029053 1.513471
H  -2.060261 1.338813 -1.072459
H  3.760438 1.194871 -1.28066
H  -0.502563 -2.927861 1.129416
H  2.140199 -2.993516 1.033393
H  -2.967697 -2.388229 0.962523
H  5.397438 -0.517294 -0.4451
H  1.89562 4.529296 1.108272
H  0.111216 4.558208 1.187386
H  1.061379 4.083257 2.623578
H  4.596667 -2.590142 0.699365
H  -4.339097 1.072633 -1.837831
H  -4.266822 1.915563 -0.267689
H  -5.758475 1.028297 -0.735647
