program: Gaussian 09
title: 000270564
version: EM64L-G09RevD.01
frameworkgroup: C1[X(C16H15NO)]
method: RPBEPBE
basis: SDD
operation: Freq
keyword: #p
keyword: freq=noraman
keyword: PBEPBE/SDD
title: #p freq=noraman PBEPBE/SDD
converged: NO YES NO NO
title: Mulliken charges:
elementType: O N C C C C C C C C C C C C C C C C H H H H H H H H H H H H H H H
charge: -0.261670 -0.449715 -0.413455 0.358766 0.314434 0.178070 0.170920 -0.701811 -0.598661 -0.389470 -0.444964 -0.400609 0.516233 -0.491530 -0.244060 -0.235888 0.208941 -0.800776 0.246212 0.219493 0.231417 0.233582 0.320340 0.239781 0.241323 0.236634 0.217361 0.224140 0.224050 0.309312 0.236471 0.269079 0.236049
chargesum: 0.00000
title: Mulliken charges with hydrogens summed into heavy atoms:
elementType: O N C C C C C C C C C C C C C C C C
charge: -0.261670 -0.140403 -0.167243 0.358766 0.314434 0.178070 0.170920 -0.017319 -0.278321 -0.149689 -0.203641 -0.163974 0.516233 -0.274169 -0.019920 -0.011838 0.208941 -0.059178
polarizability: 3.21184729e+02 2.11254681e-01 1.86861404e+02 1.77160479e+00 -8.04801443e+00 8.61951868e+01
1716.lowfreq: -82.6679 -11.1140 -4.4458 0.0005 0.0007 0.0007 1.6745 40.0876 59.4482
frequency: -82.6650 40.0861 59.4468 93.1585 101.2517 123.0533 135.3303 189.7787 195.5291 228.8373 257.0169 280.0016 344.3922 347.7086 365.1998 429.1572 448.5340 459.5245 520.3115 544.8899 550.0686 567.3597 574.5477 607.2571 643.1334 643.9278 654.1096 724.1394 738.5640 750.8493 759.7563 787.5004 791.6024 826.0678 875.5652 908.0746 929.8186 942.0044 943.7691 945.7503 982.9523 984.5944 989.8192 1000.6896 1021.5568 1029.2690 1053.2584 1067.3368 1105.6876 1134.9296 1152.3189 1168.8270 1188.8419 1213.7620 1218.7414 1235.8770 1265.5374 1275.6805 1291.4998 1310.8464 1371.8813 1375.2396 1387.5029 1391.9626 1439.3857 1445.7065 1453.1218 1458.1705 1468.3286 1475.7687 1477.5863 1489.2927 1513.1082 1590.0987 1595.7412 1620.0592 1627.7758 1630.4514 2964.4413 2987.0870 2987.3141 3072.0079 3083.5821 3093.5185 3108.8146 3119.9657 3126.9282 3137.0100 3140.6574 3144.5384 3160.2261 3182.0457 3521.0301
redmass: 1.0470 4.9209 4.8245 3.4693 4.6374 3.9789 3.5445 3.0454 5.2516 1.1194 3.5348 3.8845 5.5573 4.2614 3.6602 4.5763 3.0102 3.3229 4.7248 4.5934 4.0121 3.7540 3.4270 3.4397 3.6072 1.5148 2.9643 4.9738 3.8989 1.5792 3.5597 2.3951 3.2574 1.6135 1.4154 2.8929 5.7556 1.3535 1.3952 1.3933 1.3270 2.0417 2.9963 2.5618 2.1764 1.6570 1.4844 2.4407 1.8425 1.7119 1.5491 1.1169 1.7024 1.7354 2.0197 2.2975 1.5460 1.7952 1.6139 2.4117 3.1849 1.4729 4.7079 1.2072 2.3207 1.8216 1.9416 2.3357 1.0470 1.0667 1.1011 3.9575 2.0620 6.8698 6.2338 7.0982 7.3341 4.8607 1.0818 1.0384 1.0346 1.0984 1.1001 1.1012 1.0884 1.0852 1.0893 1.0978 1.0945 1.0955 1.1002 1.0930 1.0763
irintensity: 0.0132 0.3148 12.4091 0.5750 3.9899 1.8038 0.1140 0.0827 2.3916 0.1222 0.4126 0.5240 2.1260 0.3124 0.9636 7.5154 7.6323 12.1015 0.3139 2.5877 2.3684 0.8343 2.7120 6.0767 17.4569 42.9449 8.3133 0.3668 13.1161 65.2905 4.2371 33.6918 1.4566 42.1397 0.1656 2.7542 8.5852 17.1776 5.3770 4.0149 0.1468 6.4337 25.8514 10.2864 10.9474 7.7784 1.3684 1.5027 6.7621 8.3845 4.5478 0.6008 2.8267 3.7957 15.4726 83.6367 16.6874 3.4784 18.3213 20.0534 37.4341 91.3926 53.6706 11.1985 70.6051 115.4807 51.9020 24.9988 19.4892 8.1393 13.6104 178.1582 196.3427 2.8914 78.8110 0.7835 29.0161 127.5648 9.4865 12.3595 32.0413 15.9649 26.3188 26.0767 25.9154 4.2327 3.1836 7.2334 22.3671 27.2349 43.7070 5.1000 12.1543
temp: 298.150 k
press: 1.00000 atm
elementType: 8 7 6 6 6 6 6 6 6 6 6 6 6 6 6 6 6 6 1 1 1 1 1 1 1 1 1 1 1 1 1 1 1
symmnumber: 1
zpe: 697778.5 jmol-1
zpe.correction: 0.265770 hartree
zpe.thermalcorrener: 0.280576 hartree
zpe.thermalcorrenthalpy: 0.281521 hartree
zpe.thermalcorrgfe: 0.223662 hartree
zpe.sumelectzpe: -747.458963 hartree
zpe.sumelectthermal: -747.444157 hartree
zpe.sumelectthermalent: -747.443212 hartree
zpe.sumelectthermalfe: -747.501071 hartree
dipole: 1.2028 -3.0097 0.4311
dipole: 3.2697
quadrupole: -86.3908 -97.1978 -110.6572
quadrupole: -16.1156 1.8957 -1.5474
quadrupole: 11.6912 0.8841 -12.5753 -16.1156 1.8957 -1.5474
hfenergy: -747.724733 hartree
pointgroup: C01 [X(C16H15N1O1)]
dipole: 0.4625838 1.1906188 -0.1525223 debye
polarizability: 321.1822745|1.0550065|187.0708476|-1.2905736|-6.6801626|85.9881972 unknown
InChI: InChI=1S/C16H15NO/c1-10-13-5-3-4-6-14(13)15-8-7-12(9-16(10)15)17-11(2)18/h3-10,17H,1-2H3
charge 0 multiplicity 1
33 atoms
O  4.109506 -1.550774 0.19953
N  3.568617 0.72519 -0.024318
C  -1.027057 -1.542415 0.242163
C  -0.010323 -0.405446 0.116781
C  -2.359296 -0.792664 0.16579
C  -0.680831 0.847145 -0.015327
C  -2.13514 0.610348 0.014629
C  -0.864767 -2.646227 -0.836708
C  1.389385 -0.495556 0.120298
C  0.071441 2.035125 -0.146837
C  -3.667465 -1.302501 0.223237
C  -3.224371 1.505208 -0.078322
C  2.143017 0.704724 -0.014561
C  1.477961 1.958027 -0.145603
C  -4.761546 -0.404906 0.129202
C  -4.539254 0.986926 -0.019823
C  4.465363 -0.341662 0.077764
C  5.934363 0.082843 0.017956
H  -0.923983 -2.022282 1.238603
H  -1.638325 -3.426101 -0.717711
H  -0.958142 -2.216668 -1.849304
H  0.124545 -3.130181 -0.75437
H  1.915653 -1.446531 0.221445
H  -0.420478 3.008452 -0.249053
H  -3.847103 -2.377708 0.339042
H  -3.060955 2.582861 -0.192984
H  2.071812 2.875886 -0.248075
H  -5.787181 -0.788221 0.172208
H  -5.39619 1.66641 -0.09044
H  3.987867 1.653213 -0.123132
H  6.169493 0.586809 -0.937955
H  6.56029 -0.81633 0.105702
H  6.188493 0.773905 0.843074
