program: Gaussian 09
title: 000276123
version: EM64L-G09RevD.01
frameworkgroup: C1[X(C3H5NO2)]
method: RPBEPBE
basis: SDD
operation: Freq
keyword: #pfreq=noraman
keyword: PBEPBE/SDD
title: #p freq=noraman PBEPBE/SDD
converged: YES YES NO NO
title: Mulliken charges:
elementType: O O N C C C H H H H H
charge: -0.267371 -0.216398 -0.619647 -0.535826 0.213728 -0.004894 0.273209 0.273403 0.185200 0.332796 0.365800
chargesum: 0.00000
title: Mulliken charges with hydrogens summed into heavy atoms:
elementType: O O N C C C
charge: -0.267371 -0.216398 0.078949 0.010785 0.213728 0.180306
polarizability: 5.27890826e+01 -2.91689461e+00 5.18137984e+01 -9.95639347e-03 2.26026492e-02 2.52799181e+01
1716.lowfreq: -21.4777 -8.7393 -3.9659 -0.0012 -0.0011 -0.0010 8.3383 135.4717 263.2897
frequency: 6.1285 135.4694 263.2894 367.1475 472.8294 493.3417 656.3239 675.7174 745.4984 780.0191 831.1423 965.7065 1003.6375 1110.3564 1193.4592 1298.0860 1348.6275 1392.8679 1398.5599 1577.0994 1639.4885 1647.9068 2904.9176 2983.8186 3021.5080 3406.9614 3624.8590
redmass: 2.5939 2.8615 6.6798 6.8116 1.6867 3.7282 1.2617 4.0079 1.6076 1.1583 5.2644 2.0344 1.9922 1.8355 1.1907 1.8787 2.2849 1.2719 1.2218 1.5714 2.9923 8.4943 1.0857 1.0634 1.0943 1.0541 1.0972
irintensity: 11.1301 5.7275 31.9221 4.7740 21.4101 5.8549 157.7746 19.8869 0.3434 155.0911 2.1719 14.3770 1.8574 0.8350 2.6988 23.1576 92.4518 35.4658 28.9552 177.6004 10.1772 417.9385 114.3544 10.5727 0.5719 122.8078 72.9476
temp: 298.150 k
press: 1.00000 atm
elementType: 8 8 7 6 6 6 1 1 1 1 1
symmnumber: 1
zpe: 214997.5 jmol-1
zpe.correction: 0.081888 hartree
zpe.thermalcorrener: 0.088273 hartree
zpe.thermalcorrenthalpy: 0.089217 hartree
zpe.thermalcorrgfe: 0.049482 hartree
zpe.sumelectzpe: -322.052149 hartree
zpe.sumelectthermal: -322.045764 hartree
zpe.sumelectthermalent: -322.044820 hartree
zpe.sumelectthermalfe: -322.084555 hartree
dipole: -2.4480 -0.5621 0.0262
dipole: 2.5118
quadrupole: -46.6689 -28.8509 -34.7829
quadrupole: 8.8346 0.0207 -0.0138
quadrupole: -9.9013 7.9167 1.9846 8.8346 0.0207 -0.0138
hfenergy: -322.134037 hartree
pointgroup: C01 [X(C3H5N1O2)]
dipole: 0.9458377 0.2019957 -0.202946 debye
dipolederiv: -0.8363962 -0.0769606 0.3854361 -0.0936559 -0.4061181 0.0570211 0.1622367 0.0031515 -0.8522612 -0.5752878 -0.066346 0.0178366 -0.0630588 -0.3156539 -0.0347128 0.0662694 -0.0219937 -0.8498609 -0.4557576 0.0377335 -0.1922424 0.0555223 -0.6715806 -0.0783753 0.0411672 -0.0217998 -1.090061 -0.4470866 -0.1248761 0.1305314 -0.1215868 0.0759625 0.0067947 0.1554138 0.0092064 -0.3473824 1.0764369 0.1920713 -0.1918045 0.198186 0.2481851 0.0499287 -0.0920153 0.0761951 1.4852943 0.7857036 0.1576277 -0.1642798 0.1591359 0.1526439 0.0220803 -0.1437194 0.0282495 1.0247896 0.0655182 -0.0284484 0.0447821 -0.0436685 0.0175038 -0.0751471 -0.0067586 -0.0639647 0.1229934 0.0310501 0.0328023 -0.0003841 0.043062 0.0734334 0.0919678 -0.0400962 0.0598476 0.1052445 -0.2429707 -0.0891054 -0.0783096 -0.0949862 0.0707511 -0.0274993 -0.1110418 -0.0365819 -0.0259068 0.1333559 -0.0593135 0.0150846 -0.0594663 0.3744921 -0.0094813 0.0066249 -0.0118014 0.2070468 0.4654342 0.0248151 0.0333497 0.0205164 0.3803808 -0.0025768 -0.0380809 -0.0205085 0.2201038 unknown
polarizability: 49.1012243|5.5301323|26.7140625|-2.6652474|1.4508465|54.0675123 unknown
InChI: InChI=1S/C3H5NO2/c4-3(6)1-2-5/h2H,1,4H2
charge 0 multiplicity 1
11 atoms
O  -2.075104 0.132827 1.325701
O  1.236879 0.727726 -1.422784
N  -1.41304 0.121082 -0.909802
C  0.255257 0.645122 0.854701
C  -1.183735 0.276457 0.436901
C  1.350341 0.844952 -0.17482
H  0.195076 1.565497 1.472003
H  0.600587 -0.130353 1.570282
H  2.340466 1.122109 0.264628
H  -2.355932 -0.123417 -1.212297
H  -0.647794 0.2544 -1.582314
