program: Gaussian 09
title: 000270563
version: EM64L-G09RevD.01
frameworkgroup: C1[X(C11H9Br)]
method: RPBEPBE
basis: SDD
operation: Freq
keyword: #pfreq=noraman
keyword: PBEPBE/SDD
title: #p freq=noraman PBEPBE/SDD
converged: NO NO NO NO
title: Mulliken charges:
elementType: Br C C C C C C C C C C C H H H H H H H H H
charge: -0.001142 0.215676 0.502074 0.336149 -0.387847 -0.420922 -0.447799 -0.407092 -0.242683 -0.832803 -0.253477 -0.212754 0.248370 0.251560 0.234689 0.230599 0.233233 0.237309 0.233214 0.233489 0.250157
chargesum: 0.00000
title: Mulliken charges with hydrogens summed into heavy atoms:
elementType: Br C C C C C C C C C C C
charge: -0.001142 0.215676 0.502074 0.336149 -0.139477 -0.169363 -0.213110 -0.407092 -0.012084 -0.129047 -0.019988 0.037403
polarizability: 1.87016173e+02 -4.46811713e+00 1.62459943e+02 8.45337526e-03 1.35521690e-03 5.42842565e+01
1716.lowfreq: -6.3608 -4.3155 0.0002 0.0003 0.0005 7.6979 73.0301 162.7641 168.7819
frequency: 73.0202 162.7640 168.7816 182.4131 191.0811 253.9577 256.3498 312.6540 458.3197 466.0902 469.2219 483.5075 505.7212 571.4469 577.4814 636.6716 742.2429 747.8855 781.3612 800.9489 821.3138 845.1599 904.7694 916.8962 977.1079 977.4562 989.7077 1046.4235 1056.7466 1065.0659 1093.4663 1165.2472 1183.7501 1204.3978 1244.0797 1258.2404 1354.6366 1384.3477 1400.2471 1405.8923 1415.6756 1450.2120 1472.4796 1481.7724 1501.0156 1577.2834 1599.0821 1622.4376 2970.8915 3045.7188 3084.6034 3125.7615 3139.2736 3145.2991 3161.7067 3167.1520 3173.9006
redmass: 4.5444 8.4533 2.0164 3.6327 1.4551 3.0298 5.8871 4.0205 3.9569 3.7580 3.2262 5.5170 6.5873 3.2147 6.1371 3.6335 1.4245 6.5218 5.5460 1.3234 2.6940 4.1105 1.3761 1.4104 1.9587 1.3407 1.3470 1.5550 2.9948 2.6118 1.7718 1.3320 1.2907 1.5668 1.9476 1.9382 2.4418 2.5242 1.4798 2.6862 3.2313 2.4495 1.0461 1.1365 4.0171 7.7336 5.5278 6.5781 1.0381 1.0974 1.0976 1.0877 1.0864 1.0913 1.0925 1.0979 1.0985
irintensity: 0.0436 0.4146 0.5381 0.0847 4.4399 6.7697 1.4121 1.6651 0.0421 2.1988 0.1074 1.1345 0.2846 2.8729 13.5971 1.5871 1.8677 36.3677 2.9052 129.9906 5.5274 5.1706 0.0064 0.0976 6.3301 0.5316 1.0318 6.7867 31.1814 12.9765 4.1214 1.6466 0.3822 6.1026 7.7398 3.7332 29.6418 3.1329 34.5453 8.7098 8.3312 0.4672 14.8350 18.1714 31.9589 8.8013 9.2064 0.1505 32.2388 19.3290 20.1020 12.9784 3.4099 15.2174 10.3864 19.6500 12.3167
temp: 298.150 k
press: 1.00000 atm
elementType: 35 6 6 6 6 6 6 6 6 6 6 6 1 1 1 1 1 1 1 1 1
symmnumber: 1
zpe: 426296.1 jmol-1
zpe.correction: 0.162368 hartree
zpe.thermalcorrener: 0.172429 hartree
zpe.thermalcorrenthalpy: 0.173374 hartree
zpe.thermalcorrgfe: 0.126021 hartree
zpe.sumelectzpe: -437.211713 hartree
zpe.sumelectthermal: -437.201651 hartree
zpe.sumelectthermalent: -437.200707 hartree
zpe.sumelectthermalfe: -437.248059 hartree
dipole: 2.4559 0.7892 0.0003
dipole: 2.5796
quadrupole: -71.8262 -68.5198 -84.9760
quadrupole: -0.4518 0.0011 0.0003
quadrupole: 3.2811 6.5875 -9.8687 -0.4518 0.0011 0.0003
hfenergy: -437.3740803 hartree
pointgroup: C01 [X(C11H9Br1)]
dipole: 0.7900069 0.6371005 0.0001111 debye
dipolederiv: -0.4366303 -0.2958278 -0.0000278 -0.3894482 -0.3731936 -0.0000281 -0.0000264 -0.0000208 -0.0448032 -0.0136404 -0.2076785 -0.0000123 0.0054173 -0.0025874 0.0000051 -0.0000088 -0.0000131 0.0026267 -0.2406241 -0.1895495 -0.0000196 -0.3937584 -0.1452624 -0.0000273 -0.0000316 -0.0000177 0.0810751 0.1490695 0.1677811 0.000031 0.2302755 0.1514996 0.0000386 0.000093 0.0000858 -0.026661 -0.0697127 0.045986 0.0000193 0.0117444 -0.0001748 0.0000225 0.0000077 0.0000148 -0.1599382 -0.0907377 0.0979473 0.0000012 0.0039459 -0.026232 -0.0000029 0.0000052 0.000001 -0.1705362 0.0931528 0.023593 0.0000194 -0.1050129 -0.1591956 -0.0000139 0.0000112 -0.0000024 -0.1791861 0.7421797 0.5246744 0.0000565 0.785175 0.6350605 0.0000583 0.0000588 0.0000464 -0.1422069 -0.0228118 -0.0418903 0.0000025 0.0235132 0.1725979 0.0000165 -0.0000048 0.0000115 -0.138031 -0.0016737 -0.0733482 -0.0000195 -0.1038329 -0.0654565 -0.000026 -0.0000953 -0.0000908 0.0666695 0.024023 0.0572143 0.0000068 0.0147441 0.1303782 0.0000078 0.0000182 0.000012 -0.1611111 -0.1107705 -0.1169359 -0.0000035 -0.1622156 -0.305102 -0.0000097 -0.0000078 -0.0000106 -0.0989271 0.0251115 -0.1167475 -0.0000152 -0.0732755 -0.0217677 -0.000016 -0.0000192 -0.0000143 0.1471381 0.0600723 -0.0937895 -0.0000065 -0.0396808 0.0070051 -0.0000061 -0.0000059 -0.0000053 0.1601262 -0.1455336 0.0336191 -0.0000116 0.012964 0.0882889 0.0000037 0.0000001 0.000001 0.1523314 0.0497415 0.0686923 -0.0000014 0.0746198 -0.1022686 -0.0000056 0.0000016 -0.0000079 0.1572849 0.0779694 0.0109076 0.0532109 -0.0536322 -0.0203195 -0.0997167 -0.0034859 -0.1151582 -0.0402379 -0.1408197 0.0115283 0.000067 0.1363586 0.0608011 -0.0000441 0.0000785 -0.0000081 0.1093543 0.0779777 0.0110414 -0.0532819 -0.0535429 -0.0204317 0.0997524 0.0034255 0.1151848 -0.0400687 0.0397105 0.0558182 -0.0000047 0.0528985 -0.1042181 -0.000007 -0.0000057 -0.0000061 0.1635768 -0.0660536 0.0269641 -0.0000105 0.0227433 0.1005786 -0.0000016 -0.0000085 -0.0000022 0.1615244 unknown
polarizability: 186.8401064|4.9250999|162.6360101|0.0074009|0.0043038|54.2842565 unknown
InChI: InChI=1S/C11H9Br/c1-8-4-2-6-10-9(8)5-3-7-11(10)12/h2-7H,1H3
charge 0 multiplicity 1
21 atoms
Br -3.169055 -1.726223 -0.000176
C  0.483451 0.567968 0.00006
C  -0.438764 -0.557906 -0.00002
C  1.91105 0.318869 0.000122
C  -0.043123 1.903537 0.000097
C  0.085227 -1.892616 -0.000032
C  2.370454 -1.002961 0.000112
C  -1.847384 -0.262225 -0.000079
C  1.462234 -2.107439 0.000036
C  2.897634 1.472617 0.000261
C  -1.41854 2.135148 0.000032
C  -2.338703 1.041234 -0.000061
H  0.648323 2.751035 0.000193
H  -0.609372 -2.73771 -0.000083
H  3.449024 -1.199433 0.00015
H  1.858951 -3.128569 0.000016
H  2.775845 2.118351 0.891106
H  3.935244 1.098322 -0.000113
H  2.775444 2.118984 -0.890061
H  -1.814048 3.156346 0.000048
H  -3.41539 1.233374 -0.000107
