program: Gaussian 09
title: 000276188
version: EM64L-G09RevD.01
frameworkgroup: C1[X(C21H25ClFN7O4S)]
method: RPBEPBE
basis: SDD
operation: Freq
keyword: #p
keyword: freq=noraman
keyword: PBEPBE/SDD
title: #p freq=noraman PBEPBE/SDD
converged: YES YES NO NO
title: Mulliken charges:
elementType: Cl S F O O O O N N N N N N N C C C C C C C C C C C C C C C C C C C C C H H H H H H H H H H H H H H H H H H H H H H H H H
charge: -0.015684 1.066938 -0.352333 -0.236795 -0.283311 -0.485830 -0.481513 -0.317556 -0.094691 -0.172057 -0.631826 -0.613544 -0.408750 -0.500589 0.188752 -0.683535 -0.709729 0.354043 0.228464 -0.021327 -0.313720 -0.375766 -0.342615 -0.331274 0.480815 -0.279100 -0.379737 0.592927 -0.332789 0.536214 -0.643339 -0.225067 -0.347131 0.320259 -0.802789 0.207441 0.237000 0.234492 0.228314 0.203205 0.243895 0.283455 0.262380 0.254223 0.339975 0.335965 0.316742 0.321357 0.207284 0.226914 0.223429 0.277762 0.234136 0.288747 0.292084 0.325784 0.299930 0.274020 0.220271 0.275182
chargesum: 0.00000
title: Mulliken charges with hydrogens summed into heavy atoms:
elementType: Cl S F O O O O N N N N N N N C C C C C C C C C C C C C C C C C C C C C
charge: -0.015684 1.066938 -0.352333 -0.236795 -0.283311 -0.485830 -0.481513 -0.317556 -0.094691 -0.172057 0.044115 0.024555 -0.120003 -0.200659 0.188752 -0.004602 -0.034316 0.354043 0.228464 -0.021327 -0.030265 -0.113385 -0.342615 -0.077051 0.480815 0.155098 0.121454 0.592927 -0.332789 0.536214 -0.409203 0.067017 -0.021347 0.320259 -0.033316
polarizability: 5.12911799e+02 -2.95932289e+01 3.12598547e+02 -3.25914261e+01 -1.32283481e+01 2.64531840e+02
1716.lowfreq: -1.4819 -0.0020 -0.0018 -0.0012 2.8819 4.1960 6.6629 11.2382 18.0251
frequency: 4.5188 10.5767 17.2656 20.0670 29.1004 31.5027 39.3725 52.6169 64.6568 66.9834 74.2196 87.9057 97.1839 108.2227 122.3404 130.9165 146.1134 149.5244 159.2209 175.7230 185.2419 187.6882 199.8693 214.4417 218.3915 221.3152 225.2319 231.1504 248.2115 262.9463 268.4696 274.7788 290.6505 302.2268 307.1578 314.5590 326.0348 345.0903 350.6455 357.2639 376.9950 378.9619 383.9334 394.9929 401.3353 420.6451 422.7852 445.2076 448.5001 477.0802 482.3907 491.2292 503.9903 510.2447 518.3693 522.9458 525.9395 536.1930 551.7877 564.5748 570.4357 602.2074 609.4984 619.4274 638.8126 662.4750 670.0391 694.3489 702.1733 710.1079 716.2716 724.4560 726.1379 776.6737 790.8825 812.0497 815.8620 849.7646 850.3540 860.0519 879.4543 887.0585 897.4485 910.5427 911.7203 917.7299 944.5024 947.5190 961.4581 979.6522 980.3963 987.7992 991.2711 993.0102 1017.5082 1032.0927 1041.6966 1050.9222 1053.4533 1103.2447 1105.0125 1119.6748 1129.5609 1131.7946 1143.5622 1144.2151 1192.0527 1192.3597 1201.3017 1214.5304 1232.6444 1248.7697 1254.1575 1262.5741 1265.5641 1289.6663 1312.1682 1338.8549 1356.8089 1363.7295 1368.4774 1371.6943 1384.2445 1398.5699 1399.3862 1403.4522 1414.5412 1446.7532 1449.1948 1459.8007 1460.8204 1465.4488 1467.1413 1468.6544 1470.3787 1474.9803 1485.1294 1488.3145 1498.6479 1514.7960 1532.8545 1551.1343 1569.0074 1586.0509 1602.5870 1604.2796 1609.9267 1617.3979 1657.5374 2946.5285 2980.1044 2983.3352 2995.6350 2997.1007 3014.0099 3079.4923 3079.5077 3083.4116 3093.3284 3099.7201 3105.3509 3109.9980 3114.3967 3151.6355 3160.2649 3168.0119 3172.1337 3199.5667 3525.3130 3549.9386 3553.0746 3567.9399 3707.6153 3730.0262
redmass: 9.6644 9.0662 5.4904 5.0864 9.5929 5.7148 5.6409 8.5573 6.5685 5.2856 6.2317 5.7045 6.1214 5.5435 4.2403 1.2349 5.1332 5.5312 5.8642 4.3726 4.4656 4.8277 3.5027 3.4303 4.7530 3.4739 1.4991 5.2483 3.8361 1.0332 3.3902 6.9578 3.7354 4.2106 2.9683 2.8541 6.0291 3.4623 3.5164 4.1616 1.6203 4.1032 2.3166 1.2940 2.5599 3.8162 5.6775 3.0402 3.1449 4.7944 3.6174 3.1035 1.8681 2.2899 3.9242 8.6515 1.3828 1.7160 7.4220 4.1003 2.2907 4.4304 1.6278 4.2804 6.5780 6.0072 7.9668 5.3068 4.4457 4.2553 5.1230 4.6375 10.7163 5.4743 3.3293 3.0568 1.8982 16.5605 1.2939 2.7726 1.6425 1.5439 3.1749 1.5868 3.1439 2.3928 1.8547 1.5722 3.2654 4.4070 5.6367 1.9619 2.2022 1.3593 2.6681 2.4981 2.4775 3.4553 1.5266 2.0013 1.9432 2.2216 2.0674 2.6917 1.3384 1.4693 1.6078 3.4234 1.5981 1.9407 1.5269 3.9368 1.9166 1.3742 1.2304 3.4744 2.3362 4.7702 2.5038 1.2236 1.7234 1.4229 1.2696 4.1683 3.1200 4.4301 1.3441 4.2322 1.0548 1.0947 1.3064 1.3576 1.7862 1.0715 1.1342 1.0669 1.9876 1.1922 1.6141 2.4164 2.5257 7.3132 1.7881 5.1619 3.6933 6.2573 3.2819 2.0880 4.5820 1.0575 1.0347 1.0690 1.0369 1.0354 1.1045 1.0999 1.0974 1.0941 1.0998 1.1006 1.1002 1.0992 1.0918 1.0877 1.0912 1.0931 1.0964 1.0953 1.0765 1.0772 1.0444 1.0437 1.1052 1.1058
irintensity: 0.2191 0.1615 3.2231 0.8382 0.0601 1.4865 0.5289 9.3555 0.3800 2.3142 3.9623 0.2784 2.2628 4.3945 0.3795 2.0632 0.7603 6.5399 2.6120 1.4304 6.6565 0.2303 1.7506 0.1792 0.1239 2.2397 0.3169 5.4259 15.1629 0.4646 3.9811 3.3261 8.2019 11.4337 6.5299 1.6070 25.5976 8.6500 18.5081 2.6802 100.3093 4.3757 112.2111 154.4956 43.1949 16.8882 35.1083 24.6542 10.7156 53.8138 8.1317 39.4943 28.0889 7.9638 2.4128 75.1264 2.5060 35.7970 78.3891 5.4512 173.2215 11.2609 99.1073 0.6848 21.1489 2.4996 1.0063 40.2985 24.7697 14.9920 3.3378 15.0483 32.1536 8.9368 4.6337 44.4686 55.1115 128.3307 20.8841 7.8433 48.1399 7.4252 58.9889 0.5915 7.5554 4.1220 10.7242 6.6153 14.0136 65.1676 21.1378 17.8190 20.9219 0.3564 10.4248 29.7694 43.1774 10.2344 15.6299 8.1237 5.0252 3.7933 49.9823 8.0147 26.3075 2.7734 142.3817 40.4109 136.0757 166.4695 451.4896 162.0498 64.6518 4.5666 38.8361 8.3897 74.9967 11.6372 117.4146 34.6525 90.1085 51.5099 24.1803 92.0544 20.4009 360.0462 17.1075 146.4946 1.0191 11.9416 35.1176 329.4643 40.5923 3.6818 99.7607 23.4090 109.3224 55.6147 249.5319 686.3358 245.5907 27.1011 196.7431 36.7263 318.6181 217.0674 353.4268 429.8365 184.8344 34.6182 16.1619 71.2466 8.7003 19.0150 44.3592 30.1915 0.3577 7.8932 13.2282 32.8314 8.4313 29.3329 20.7685 12.0726 7.3575 1.4727 3.6136 16.1764 7.2215 28.7123 57.1863 94.1806 56.7146 37.9642
temp: 298.150 k
press: 1.00000 atm
elementType: 17 16 9 8 8 8 8 7 7 7 7 7 7 7 6 6 6 6 6 6 6 6 6 6 6 6 6 6 6 6 6 6 6 6 6 1 1 1 1 1 1 1 1 1 1 1 1 1 1 1 1 1 1 1 1 1 1 1 1 1
symmnumber: 1
zpe: 1184635.9 jmol-1
zpe.correction: 0.451204 hartree
zpe.thermalcorrener: 0.487556 hartree
zpe.thermalcorrenthalpy: 0.488500 hartree
zpe.thermalcorrgfe: 0.377561 hartree
zpe.sumelectzpe: -2454.632045 hartree
zpe.sumelectthermal: -2454.595693 hartree
zpe.sumelectthermalent: -2454.594749 hartree
zpe.sumelectthermalfe: -2454.705688 hartree
dipole: -8.2264 7.3198 5.4991
dipole: 12.3083
quadrupole: -318.7819 -212.7960 -210.4488
quadrupole: 7.0238 32.5138 3.4715
quadrupole: -71.4396 34.5463 36.8934 7.0238 32.5138 3.4715
hfenergy: -2455.083249 hartree
pointgroup: C01 [X(C21H25Cl1F1N7O4S1)]
dipole: 3.3639654 -2.8492603 2.0036992 debye
polarizability: 515.3939606|-22.8712202|309.0326798|29.1682449|16.8500751|265.6155462 unknown
InChI: InChI=1S/C21H25ClFN7O4S/c1-12-10-13(4-7-17(12)35(23,32)33)27-20(31)26-8-9-34-16-6-5-14(11-15(16)22)30-19(25)28-18(24)29-21(30,2)3/h4-7,10-11,26-27H,8-9,24-25H2,1-3H3
charge 0 multiplicity 1
60 atoms
Cl 0.34763 0.508186 -1.170172
S  -8.789446 1.102255 -0.368273
F  -8.155345 2.856627 -0.570177
O  0.671408 -2.253348 -0.170157
O  -3.203057 -3.046038 -0.937442
O  -9.284925 0.61661 -1.818813
O  -9.818951 1.190173 0.865349
N  5.498815 0.749257 -0.096894
N  7.255893 1.907763 1.214436
N  7.587339 1.320616 -1.147655
N  5.985759 0.116552 -2.33876
N  9.354631 2.06625 0.178602
N  -1.804095 -3.207544 0.926497
N  -3.595084 -1.697433 0.967568
C  5.804428 1.751323 1.045338
C  5.166714 3.120553 0.676311
C  5.222375 1.211893 2.365094
C  4.290602 -0.028542 -0.115457
C  6.374834 0.755512 -1.178466
C  8.003118 1.774884 0.124366
C  3.070853 0.535136 -0.583145
C  4.295342 -1.37064 0.334841
C  1.896365 -0.232421 -0.58007
C  3.112314 -2.138364 0.332385
C  1.89131 -1.578055 -0.124162
C  0.60584 -3.605262 0.400402
C  -0.842757 -4.085071 0.254691
C  -6.50558 0.624735 1.271796
C  -7.172972 0.288498 0.066691
C  -4.79631 -1.054039 0.605709
C  -5.307594 -0.079454 1.511785
C  -6.695855 -0.651615 -0.86499
C  -5.498453 -1.335974 -0.600006
C  -2.887293 -2.675689 0.229114
C  -7.003568 1.671763 2.247021
H  4.064122 3.054882 0.623521
H  5.435743 3.861474 1.448909
H  5.558428 3.477337 -0.293056
H  5.663581 0.230086 2.606391
H  4.122342 1.125328 2.333366
H  5.504335 1.916018 3.164754
H  3.046953 1.56733 -0.944222
H  5.235453 -1.805468 0.687683
H  3.14655 -3.17365 0.683827
H  5.040995 -0.231962 -2.475022
H  6.668937 0.08145 -3.091114
H  9.752037 2.416603 1.045026
H  9.928928 1.883399 -0.638391
H  0.92632 -3.575936 1.464143
H  1.275761 -4.296252 -0.150822
H  -0.902799 -5.121082 0.646279
H  -1.134321 -4.111979 -0.808752
H  -4.754324 0.146272 2.432486
H  -1.614895 -2.926628 1.889689
H  -7.252589 -0.844448 -1.787415
H  -5.096082 -2.065222 -1.303962
H  -3.176852 -1.381724 1.845438
H  -7.982677 1.389188 2.672578
H  -6.286139 1.808935 3.07183
H  -7.147794 2.64245 1.739283
