program: Gaussian 09
title: 000270562
version: EM64L-G09RevD.01
frameworkgroup: C1[X(C13H14O)]
method: RPBEPBE
basis: SDD
operation: Freq
keyword: #pfreq=noraman
keyword: PBEPBE/SDD
title: #p freq=noraman PBEPBE/SDD
converged: YES YES NO NO
title: Mulliken charges:
elementType: O C C C C C C C C C C C C C H H H H H H H H H H H H H H
charge: -0.463916 -0.214216 0.495183 -0.400928 0.376731 -0.566175 0.380095 -0.447852 -0.430102 -0.690567 -0.425484 -0.408952 -0.244572 -0.243636 0.195592 0.230068 0.186116 0.274762 0.231835 0.234336 0.203219 0.220362 0.243849 0.240753 0.236149 0.334966 0.226329 0.226055
chargesum: 0.00000
title: Mulliken charges with hydrogens summed into heavy atoms:
elementType: O C C C C C C C C C C C C C
charge: -0.128950 -0.018624 0.495183 0.015256 0.376731 -0.291413 0.380095 -0.216018 -0.195766 -0.023136 -0.184731 -0.172803 -0.018242 -0.017581
polarizability: 2.17101468e+02 4.92179657e+00 1.40974794e+02 -1.31009223e+01 -1.34497634e+01 8.10205617e+01
1716.lowfreq: -3.7675 -0.0005 -0.0004 -0.0004 12.2661 15.4852 35.7058 70.2994 108.6587
frequency: 35.1334 70.1831 108.6484 161.3715 168.0373 184.8636 234.4003 256.9976 299.3559 316.0121 371.2480 400.4291 415.8211 453.9808 481.0363 512.8277 539.2700 547.6380 624.3758 664.1076 685.9857 756.2943 759.3030 785.8783 804.4066 830.8644 865.7498 878.4012 897.4567 929.8849 953.4362 957.8323 975.3049 983.4748 990.3816 1022.2472 1046.5450 1074.3598 1102.3313 1122.7760 1150.7039 1162.9039 1171.5784 1212.5041 1231.6022 1245.3557 1254.9807 1273.1304 1288.9406 1325.0062 1354.1314 1392.0590 1399.0102 1409.9061 1425.6387 1433.7035 1457.5024 1470.4854 1476.7547 1487.1199 1517.6673 1582.1958 1607.0939 1642.7191 2933.3100 2958.3421 2981.3472 3034.1556 3074.3878 3089.2643 3114.0279 3117.7546 3123.9898 3138.6718 3140.9090 3147.8970 3160.1728 3557.4047
redmass: 3.8722 4.0601 2.0578 5.2859 2.8657 3.4890 1.3759 2.3371 1.4568 2.5583 3.1624 3.8718 3.2541 4.0418 2.5147 6.8327 5.3489 3.3255 6.1259 2.7793 3.1318 1.3418 4.1501 2.5836 1.5022 1.3844 1.7191 1.6660 3.2968 1.5601 3.4139 1.4101 1.4104 6.0704 1.3560 2.2610 2.0546 1.8648 1.9092 1.7067 1.5165 1.2069 1.0800 1.2387 2.2538 1.3230 1.4541 1.7743 1.1468 1.4451 1.7377 1.2777 1.4708 5.2695 3.7382 3.1473 1.1690 2.2666 1.0422 1.0559 3.6946 7.3718 5.6243 6.8897 1.0840 1.0637 1.0371 1.0967 1.0987 1.1002 1.0863 1.0856 1.0885 1.0969 1.0951 1.0916 1.1004 1.0658
irintensity: 0.9568 0.8013 1.7783 2.7783 0.3101 1.1580 0.4990 11.1162 104.9746 31.6775 2.7496 5.5308 0.9329 5.0765 26.0505 0.1838 11.2879 0.6341 3.2885 0.9865 3.1509 39.1457 2.3629 1.1295 30.4433 63.2563 22.2968 8.1866 16.7580 15.7361 3.3587 7.6354 6.9136 46.3158 0.3558 5.7413 0.9877 9.0757 5.4692 26.9353 19.8283 7.2909 1.2000 28.2256 4.7528 4.6994 1.4976 7.5439 4.1889 3.4895 12.3511 11.0785 25.0548 2.2255 0.6275 0.3346 4.5865 3.1976 7.9343 12.6347 9.6909 0.2145 6.3465 3.3680 49.7433 63.5576 29.0473 20.5297 46.3919 52.6582 6.4223 3.9168 0.3597 18.0320 46.2831 2.3576 36.4354 5.2431
temp: 298.150 k
press: 1.00000 atm
elementType: 8 6 6 6 6 6 6 6 6 6 6 6 6 6 1 1 1 1 1 1 1 1 1 1 1 1 1 1
symmnumber: 1
zpe: 608976.9 jmol-1
zpe.correction: 0.231947 hartree
zpe.thermalcorrener: 0.244434 hartree
zpe.thermalcorrenthalpy: 0.245378 hartree
zpe.thermalcorrgfe: 0.193021 hartree
zpe.sumelectzpe: -578.002967 hartree
zpe.sumelectthermal: -577.990480 hartree
zpe.sumelectthermalent: -577.989535 hartree
zpe.sumelectthermalfe: -578.041893 hartree
dipole: 1.7969 0.8616 0.9331
dipole: 2.2004
quadrupole: -65.1876 -77.5170 -88.7398
quadrupole: -1.1559 -0.9008 -4.9078
quadrupole: 11.9605 -0.3688 -11.5917 -1.1559 -0.9008 -4.9078
hfenergy: -578.2349136 hartree
pointgroup: C01 [X(C13H14O1)]
dipole: -0.6843665 0.0804356 -0.5240647 debye
polarizability: 217.5704122|-10.3408178|135.1217024|-2.4106082|-22.7899171|86.4047096 unknown
InChI: InChI=1S/C13H14O/c1-2-13(14)12-8-7-10-5-3-4-6-11(10)9-12/h3-9,13-14H,2H2,1H3
charge 0 multiplicity 1
28 atoms
O  -2.876141 -0.987393 1.658878
C  -2.759353 -0.069859 0.505159
C  -1.275741 0.199702 0.300911
C  -3.438583 -0.703979 -0.741731
C  1.068198 -0.56861 0.307812
C  -0.326185 -0.798346 0.541868
C  1.499498 0.723125 -0.190839
C  -0.841276 1.479838 -0.178597
C  0.509612 1.734074 -0.421229
C  -3.460516 0.212077 -1.9833
C  2.056734 -1.57995 0.552579
C  2.896229 0.949985 -0.426297
C  3.410056 -1.331594 0.312468
C  3.834127 -0.055648 -0.181688
H  -3.276017 0.888974 0.735094
H  -2.914662 -1.65128 -0.972596
H  -4.483504 -0.966535 -0.468692
H  -0.658277 -1.761944 0.942792
H  -1.584564 2.269175 -0.345442
H  0.829647 2.718084 -0.784638
H  -3.984538 1.163716 -1.771668
H  -3.985313 -0.279971 -2.821609
H  -2.437262 0.455556 -2.318223
H  1.731504 -2.555408 0.933839
H  3.21863 1.92877 -0.802115
H  -3.818716 -1.285022 1.729932
H  4.155182 -2.112005 0.502727
H  4.898829 0.126772 -0.365197
