program: Gaussian 09
title: 000270559
version: EM64L-G09RevD.01
frameworkgroup: C1[X(C14H12O4)]
method: RPBEPBE
basis: SDD
operation: Freq
keyword: #pfreq=noraman
keyword: PBEPBE/SDD
title: #p freq=noraman PBEPBE/SDD
converged: NO YES NO NO
title: Mulliken charges:
elementType: O O O O C C C C C C C C C C C C C C H H H H H H H H H H H H
charge: -0.317460 -0.423990 -0.484536 -0.231650 0.218029 0.076893 0.015170 0.338840 -0.369578 -0.007758 0.262177 -0.359490 -0.327784 -0.358968 -0.244448 -0.236877 -0.231966 -0.521689 0.269489 0.244979 0.242714 0.268826 0.226521 0.228706 0.228419 0.390541 0.396860 0.230625 0.232306 0.245099
chargesum: 0.00000
title: Mulliken charges with hydrogens summed into heavy atoms:
elementType: O O O O C C C C C C C C C C C C C C
charge: -0.317460 -0.033449 -0.087676 -0.231650 0.218029 0.076893 0.015170 0.338840 -0.100090 -0.007758 0.262177 -0.114511 -0.085070 -0.090141 -0.017927 -0.008171 -0.003547 0.186341
polarizability: 2.65347698e+02 7.68554262e+00 1.58328140e+02 1.25307674e+01 -8.31162695e+00 9.67475805e+01
1716.lowfreq: -3.0874 -0.0003 0.0002 0.0007 0.9794 5.3984 31.3823 45.2408 67.8190
frequency: 31.3057 45.1497 67.7919 78.7905 112.8848 156.4100 162.4267 173.0880 200.6417 216.4056 251.1845 277.9251 290.8991 316.4745 354.9635 372.6908 403.4045 419.6312 428.1634 485.0739 495.3124 506.2368 541.9105 554.7948 584.4782 613.6317 640.7152 671.5948 688.3380 693.9758 703.1146 743.4175 782.4315 811.5584 851.1117 856.2776 895.6931 935.4760 941.7243 978.2835 985.3968 991.0159 1001.3438 1027.4031 1064.1514 1084.7745 1116.8887 1141.7366 1165.9260 1170.9114 1172.5831 1186.7806 1187.6180 1222.3692 1258.4015 1284.2015 1314.5612 1319.4925 1387.5497 1421.7924 1433.8427 1437.0898 1466.2279 1467.3334 1477.1637 1478.2926 1491.5723 1528.3576 1589.8398 1595.4142 1610.0720 1631.3483 2974.8363 3068.1230 3125.6486 3133.1642 3137.1196 3149.8371 3157.1602 3159.8343 3168.9294 3177.4405 3500.5890 3554.6752
redmass: 5.3560 4.5111 5.0007 3.7534 6.5757 4.4101 4.4644 5.2553 3.3290 1.4071 5.5617 5.0743 5.4076 6.3153 4.1387 8.0673 2.8336 4.1328 1.1268 5.9760 2.0762 1.7803 5.3570 5.5219 5.6918 6.4084 4.3389 5.8900 5.3685 3.6445 1.9664 3.6832 1.5096 2.6648 6.6387 1.2546 5.3054 1.3786 1.4767 4.6390 1.4282 5.8975 1.3412 2.1120 4.2539 1.5741 1.2536 1.5074 1.8005 1.6035 1.0662 1.9043 1.1774 2.4794 2.2422 2.5481 1.9252 1.5203 9.3487 5.6502 2.1480 1.3194 1.0576 2.0127 1.3910 2.2950 3.0198 10.1678 6.5518 8.0797 6.0538 7.2052 1.0320 1.1048 1.0849 1.1010 1.0883 1.0927 1.0876 1.0959 1.1008 1.0962 1.0649 1.0652
irintensity: 4.1634 1.2067 1.5304 2.2746 3.3251 0.8155 2.5227 2.6745 0.6660 0.8474 1.0812 7.5785 6.4944 2.7950 5.1987 2.7461 0.4178 3.3847 191.7797 5.8432 41.0693 52.4276 21.0097 5.5104 13.8064 0.2129 12.6304 33.9654 23.1908 6.3589 50.7361 37.7108 32.0463 19.3593 68.3740 2.9624 14.4862 6.9880 1.3571 36.4877 5.7883 2.4262 1.2828 5.5765 251.4509 11.5903 0.1373 32.8203 14.9954 19.8292 0.2540 133.5584 27.6476 86.9304 205.0962 76.4115 350.6326 133.4955 3.8400 0.8397 20.0979 19.9326 17.2107 73.3187 13.6305 7.8193 5.8109 182.3517 7.4990 3.6590 32.5377 228.1177 66.8610 38.4570 0.0784 20.4960 8.4093 25.7973 0.9648 24.6118 21.4836 9.1503 77.1029 92.6697
temp: 298.150 k
press: 1.00000 atm
elementType: 8 8 8 8 6 6 6 6 6 6 6 6 6 6 6 6 6 6 1 1 1 1 1 1 1 1 1 1 1 1
symmnumber: 1
zpe: 594270.0 jmol-1
zpe.correction: 0.226346 hartree
zpe.thermalcorrener: 0.242509 hartree
zpe.thermalcorrenthalpy: 0.243454 hartree
zpe.thermalcorrgfe: 0.182281 hartree
zpe.sumelectzpe: -840.284562 hartree
zpe.sumelectthermal: -840.268398 hartree
zpe.sumelectthermalent: -840.267454 hartree
zpe.sumelectthermalfe: -840.328627 hartree
dipole: 4.8435 -2.4108 1.8661
dipole: 5.7231
quadrupole: -68.6231 -105.7624 -104.9386
quadrupole: 7.9308 2.7562 2.0283
quadrupole: 24.4849 -12.6543 -11.8306 7.9308 2.7562 2.0283
hfenergy: -840.5109075 hartree
pointgroup: C01 [X(C14H12O4)]
dipole: -1.8614373 -1.0655061 0.6852403 debye
polarizability: 262.1113584|22.285044|106.0762687|15.8458653|-19.7728648|152.2357919 unknown
InChI: InChI=1S/C14H12O4/c1-18-11-8-7-10(13(16)14(11)17)12(15)9-5-3-2-4-6-9/h2-8,16-17H,1H3
charge 0 multiplicity 1
30 atoms
O  -4.291464 -0.843471 0.348743
O  0.065721 0.476966 1.731308
O  -2.502892 -0.167511 2.277753
O  1.285557 1.083026 -2.188418
C  -0.267577 0.071767 -0.67545
C  -0.747379 0.090078 0.664333
C  1.125953 0.448662 -1.09519
C  2.325197 0.033384 -0.296467
C  -1.194259 -0.237817 -1.708198
C  -2.097523 -0.227832 0.930171
C  -2.990821 -0.561188 -0.109838
C  -2.539384 -0.564921 -1.449884
C  2.310497 -1.097905 0.559769
C  3.53718 0.750975 -0.479836
C  3.487935 -1.503956 1.221457
C  4.70832 0.357507 0.196954
C  4.687066 -0.773692 1.048459
C  -5.314591 -1.146336 -0.657285
H  -0.823403 -0.208772 -2.737102
H  -3.211907 -0.812686 -2.27503
H  1.383673 -1.66397 0.696061
H  3.535639 1.607972 -1.161363
H  3.472738 -2.385588 1.87167
H  5.636283 0.923606 0.060738
H  5.59913 -1.085473 1.570177
H  -0.477039 0.465157 2.56548
H  -3.471292 -0.373743 2.336482
H  -5.049963 -2.058283 -1.224294
H  -5.446852 -0.29607 -1.352102
H  -6.241042 -1.314687 -0.089599
