program: Gaussian 09
title: 000270556
version: EM64L-G09RevD.01
frameworkgroup: C1[X(C13H16Br2O5)]
method: RPBEPBE
basis: SDD
operation: Freq
keyword: #p
keyword: freq=noraman
keyword: PBEPBE/SDD
title: #p freq=noraman PBEPBE/SDD
converged: YES YES NO NO
title: Mulliken charges:
elementType: Br Br O O O O O C C C C C C C C C C C C C H H H H H H H H H H H H H H H H
charge: -0.015370 0.032254 -0.286793 -0.304042 -0.308025 -0.246664 -0.207116 -0.664957 0.730317 -0.573507 -0.489851 -0.599598 0.259019 0.272466 0.031857 0.332096 -0.523369 -0.527295 -0.524122 -0.490160 0.355842 0.350487 0.251851 0.260513 0.262653 0.231989 0.217261 0.232957 0.251663 0.228122 0.229615 0.258541 0.235806 0.247821 0.235998 0.251743
chargesum: 0.00000
title: Mulliken charges with hydrogens summed into heavy atoms:
elementType: Br Br O O O O O C C C C C C C C C C C C C
charge: -0.015370 0.032254 -0.286793 -0.304042 -0.308025 -0.246664 -0.207116 -0.309115 0.730317 -0.223020 -0.238000 -0.339085 0.259019 0.272466 0.031857 0.332096 0.188533 0.185447 0.199839 0.245402
polarizability: 2.59055366e+02 2.12715254e+01 1.83811767e+02 6.38613477e+00 9.83649792e-01 1.76283480e+02
1716.lowfreq: -8.8566 -4.5777 -3.5565 -0.0003 0.0005 0.0006 17.0076 26.0643 35.0502
frequency: 16.7234 26.0552 35.0204 60.4921 66.9875 71.2597 76.6756 84.9742 91.8562 99.4542 104.0553 111.0093 138.9330 148.8097 156.9742 159.8488 164.0726 174.7627 198.5260 206.7020 226.2470 241.9766 267.7294 284.1979 299.3271 324.1215 367.9982 412.8502 441.2860 483.3297 506.8175 515.4947 553.5921 587.1555 598.3967 640.2095 677.5089 682.3352 718.1749 747.2285 767.7456 795.1979 865.3146 879.9240 886.6833 906.4096 939.0889 983.3547 1006.9935 1034.9673 1070.5513 1112.7933 1113.5364 1114.7680 1115.1359 1125.9408 1137.6895 1150.0399 1151.3590 1156.0802 1158.9585 1170.0673 1196.2532 1200.4949 1219.1707 1251.9050 1300.3776 1346.2830 1373.9037 1407.4288 1419.1595 1423.5917 1435.5660 1444.7678 1453.8161 1455.9299 1458.3213 1460.3544 1461.5404 1467.3648 1476.8082 1484.7158 1486.7000 1570.8296 1603.6875 1641.3029 2974.2865 2978.0391 2982.4338 3008.1889 3072.3279 3084.2030 3086.3733 3112.4491 3113.7276 3125.1210 3126.2480 3128.4424 3130.7498 3154.9741 3156.7414 3162.0699
redmass: 6.9617 6.6348 6.0283 4.8760 4.4441 3.9207 3.2215 3.0016 2.6962 1.9234 2.5852 5.0246 1.5752 4.0711 1.8478 1.1118 2.0725 3.0468 4.4165 4.4211 4.7172 5.4819 5.3656 5.4145 5.5269 4.3434 5.2414 7.1049 6.2960 6.8996 5.6738 5.5917 6.8160 6.5528 4.9204 4.4756 4.6889 4.2957 6.5150 5.1563 3.7792 5.1815 4.0317 1.8710 1.7860 6.6167 9.4292 8.4036 4.9489 6.0415 2.9173 1.2559 1.2360 1.2418 1.2645 2.3750 1.1072 1.3475 1.4136 1.3975 1.4230 1.5404 2.1998 2.5757 1.5623 1.5112 3.7598 2.8956 3.8191 1.5657 1.2749 1.1843 1.2543 1.6715 1.0491 1.1823 1.0623 1.0917 1.0515 2.0777 1.0733 1.0548 1.0570 7.3367 6.6615 9.4498 1.0308 1.0338 1.0295 1.0294 1.1044 1.1053 1.0989 1.1050 1.0879 1.1027 1.1036 1.0870 1.1046 1.0919 1.1050 1.0921
irintensity: 0.3057 0.6779 1.3348 1.5567 1.2177 0.7829 0.6336 4.8044 9.2759 3.0476 1.0569 1.0582 0.2107 0.6422 2.0121 0.1548 1.4589 0.9618 2.9868 5.3329 6.5141 16.1010 12.8634 11.5560 6.7530 4.1143 2.8009 17.7837 8.4422 52.5736 1.8716 49.6066 55.9563 33.9691 4.9243 12.9151 13.0094 20.7214 1.8133 0.2333 5.7731 10.3076 3.4020 7.3660 15.2780 73.0788 61.8284 53.5435 25.9608 183.5300 47.6421 10.3765 11.7980 5.1533 0.0129 8.4453 29.0173 2.2602 23.1214 5.4670 14.1747 12.4534 77.1099 141.5936 8.0824 45.5117 314.3007 49.9404 43.4303 46.2296 0.4106 20.2610 38.7914 34.5584 14.8372 22.6212 18.0043 6.5583 8.1497 28.9855 2.8614 18.3632 29.1677 79.5009 3.5559 193.3526 60.6784 91.4064 57.6236 29.6910 25.4572 17.3059 32.1296 18.0901 0.2243 20.7784 22.4973 0.2923 14.3879 1.4060 12.0603 1.2955
temp: 298.150 k
press: 1.00000 atm
elementType: 35 35 8 8 8 8 8 6 6 6 6 6 6 6 6 6 6 6 6 6 1 1 1 1 1 1 1 1 1 1 1 1 1 1 1 1
symmnumber: 1
zpe: 704890.1 jmol-1
zpe.correction: 0.268478 hartree
zpe.thermalcorrener: 0.292156 hartree
zpe.thermalcorrenthalpy: 0.293100 hartree
zpe.thermalcorrgfe: 0.211381 hartree
zpe.sumelectzpe: -906.436398 hartree
zpe.sumelectthermal: -906.412721 hartree
zpe.sumelectthermalent: -906.411776 hartree
zpe.sumelectthermalfe: -906.493495 hartree
dipole: 3.1175 1.1145 1.8251
dipole: 3.7805
quadrupole: -109.0933 -139.4577 -134.1974
quadrupole: 7.5641 -14.1281 -0.3107
quadrupole: 18.4895 -11.8749 -6.6146 7.5641 -14.1281 -0.3107
hfenergy: -906.7048765 hartree
pointgroup: C01 [X(C13H16Br2O5)]
dipole: 1.1853176 -0.5982164 0.6703441 debye
polarizability: 256.6273712|-1.9651678|176.3412904|25.8336841|0.595903|186.1819512 unknown
InChI: InChI=1S/C13H16Br2O5/c1-17-8-5-7(6-9(18-2)12(8)19-3)10(14)11(15)13(16)20-4/h5-6,10-11H,1-4H3
charge 0 multiplicity 1
36 atoms
Br -2.201411 0.014384 -2.520832
Br -2.401035 0.333671 2.275255
O  2.542247 -2.636623 0.022368
O  2.365525 2.317909 0.086838
O  3.936052 -0.103744 0.207178
O  -4.529059 -0.891962 -0.053605
O  -4.974408 1.39815 -0.097857
C  -1.770181 -0.372251 -0.494852
C  -0.290158 -0.260623 -0.281761
C  -2.672146 0.608724 0.251231
C  0.361946 0.993014 -0.171844
C  0.467362 -1.450238 -0.173669
C  1.866983 -1.406787 0.015867
C  1.752242 1.046824 0.028068
C  2.53016 -0.148426 0.08292
C  -4.171489 0.447024 0.008786
C  3.489943 -2.88891 1.132089
C  3.060911 2.620127 1.361315
C  4.630729 0.452624 -0.983979
C  -5.969763 -1.160581 -0.284872
H  -2.141563 -1.40051 -0.383325
H  -2.403884 1.662218 0.091617
H  -0.179326 1.941101 -0.244492
H  -0.008752 -2.433578 -0.244109
H  4.286809 -2.128167 1.15096
H  3.905543 -3.886854 0.926761
H  2.94707 -2.898887 2.096701
H  3.496133 3.621271 1.223359
H  3.851961 1.876838 1.565424
H  2.331965 2.636839 2.193274
H  5.700456 0.448154 -0.725871
H  4.283546 1.480946 -1.187092
H  4.447399 -0.194588 -1.860697
H  -6.570811 -0.71555 0.525443
H  -6.052492 -2.255743 -0.289408
H  -6.279401 -0.731496 -1.25229
