program: Gaussian 09
title: 000270552
version: EM64L-G09RevD.01
frameworkgroup: C1[X(C19H22)]
method: RPBEPBE
basis: SDD
operation: Freq
keyword: #p
keyword: freq=noraman
keyword: PBEPBE/SDD
title: #p freq=noraman PBEPBE/SDD
converged: YES YES NO NO
title: Mulliken charges:
elementType: C C C C C C C C C C C C C C C C C C C H H H H H H H H H H H H H H H H H H H H H H
charge: -0.236320 -0.486699 -0.486221 -0.432183 -0.428829 0.490364 0.312651 0.042689 0.186102 -0.718863 0.205338 -0.556523 -0.509961 -0.414394 -0.425870 -0.410538 -0.404932 -0.269098 -0.270188 0.213597 0.213482 0.235752 0.234907 0.217145 0.207856 0.219170 0.218326 0.208081 0.227969 0.224888 0.216101 0.218759 0.218914 0.204584 0.205829 0.203550 0.208059 0.224666 0.243702 0.223946 0.224191
chargesum: 0.00000
title: Mulliken charges with hydrogens summed into heavy atoms:
elementType: C C C C C C C C C C C C C C C C C C C
charge: -0.022722 -0.037465 -0.034168 -0.005157 -0.002422 0.490364 0.312651 0.042689 0.186102 -0.490894 0.205338 -0.115534 -0.072288 -0.003981 -0.014261 -0.185871 -0.161230 -0.045153 -0.045998
polarizability: 2.47760733e+02 1.22333545e+00 2.46932859e+02 3.24145647e-01 1.42802334e+00 1.22616804e+02
1716.lowfreq: -21.8853 -8.6682 -0.0005 -0.0004 0.0008 2.3879 7.2834 23.9338 54.0443
frequency: -20.6179 23.7434 53.9736 78.3473 83.5466 109.6450 142.8854 200.9596 210.5906 220.2782 251.9673 272.3098 307.8298 367.8128 386.7541 428.8250 444.5758 462.6131 485.7654 496.6616 524.2355 575.6941 610.3279 616.8646 623.5654 651.8179 667.3085 705.6451 757.5298 762.9533 791.1461 807.4045 808.3099 827.7259 857.6780 871.6290 874.8648 890.1610 893.8117 900.3125 920.7072 953.0056 959.9267 962.4662 966.1384 974.8838 981.1336 985.9486 1038.4200 1043.1133 1068.4941 1079.0930 1083.1411 1100.5539 1106.1328 1133.2358 1158.6983 1165.9360 1173.6321 1177.2113 1181.7802 1203.1158 1220.1239 1226.2382 1248.7251 1251.6407 1263.6997 1266.1953 1266.7604 1287.8890 1297.0090 1298.7603 1301.3157 1308.4022 1333.9480 1342.1695 1345.7235 1355.1643 1379.6276 1390.3850 1414.9542 1430.6062 1448.2929 1457.2653 1463.4494 1465.0819 1470.5330 1471.6828 1472.3680 1475.8056 1490.5890 1521.6786 1585.6924 1605.2262 1622.5547 2950.9817 2952.5275 2975.8383 2978.7568 2988.8614 2992.1712 2994.8633 3007.9394 3010.6604 3014.4291 3014.7462 3038.4593 3039.3575 3046.8958 3057.8455 3061.9936 3079.9223 3102.0904 3123.7018 3139.0368 3155.1450 3165.8651
redmass: 2.0625 2.0535 3.0004 3.0666 3.2626 2.9856 2.6802 3.0529 3.5040 3.5799 3.0842 4.3581 1.8363 3.0636 4.2028 3.1308 3.1260 4.1161 2.4501 3.1680 3.7408 3.7930 2.8638 3.0885 3.4298 3.3621 4.4289 3.3972 1.3720 1.4269 2.3825 3.4008 1.5712 1.4621 3.0476 2.2551 2.3456 1.9191 2.4870 2.1398 1.5070 1.4616 1.6646 1.6011 1.4589 2.2898 3.3014 1.3444 3.9647 2.1300 2.4094 3.8775 1.8838 1.6806 2.3813 1.1539 1.3328 1.4692 1.4920 1.3247 1.3309 1.5430 1.1945 1.6680 1.2939 1.8512 1.6898 1.2696 1.3377 1.2860 1.2187 1.4104 1.4413 1.6129 1.4241 1.4716 1.5730 1.6219 4.5053 2.4682 3.6212 3.1329 1.4768 1.1555 1.0809 1.4506 1.0903 1.0994 1.0990 1.1153 1.1050 3.5262 7.5241 5.7737 6.2549 1.0641 1.0643 1.0647 1.0626 1.0586 1.0627 1.0634 1.0717 1.0928 1.0936 1.0744 1.0983 1.1005 1.1041 1.1012 1.1040 1.1044 1.0897 1.0847 1.0885 1.0935 1.0991
irintensity: 0.0535 0.0123 0.1304 0.2103 0.1023 0.5644 0.5894 0.3648 2.5750 0.2439 0.8412 0.6846 0.5296 2.6074 1.5568 0.6230 4.1806 0.9731 0.9887 0.7380 0.5281 1.7310 0.7622 3.1030 6.4509 0.6358 0.8312 1.8424 7.2615 70.1768 8.2206 2.2163 0.1153 6.8461 3.5034 0.7022 0.5568 3.9249 6.6004 8.4042 9.9587 0.2511 3.7437 0.3060 0.0319 3.4890 0.9726 0.0494 7.3193 7.0634 0.2394 0.0628 0.2969 0.5313 0.5248 2.0332 8.4969 0.9894 1.1145 0.8464 0.2931 0.2379 1.2960 0.6479 5.9139 3.0065 0.3126 0.5051 1.2329 5.3531 0.6683 1.7874 5.6095 0.4058 0.5163 1.3686 3.0037 0.4133 0.3616 20.0873 8.8803 5.8958 1.9823 13.3599 1.7534 4.7510 11.1613 9.4197 11.7172 3.1294 2.4148 7.8952 2.7298 21.4797 5.3444 31.7570 25.1361 37.4984 32.0279 1.1095 29.8835 59.7546 65.0824 46.2260 14.3331 23.9872 80.6087 20.0224 66.5814 10.4180 18.4719 89.8601 30.3688 0.8829 12.2294 41.3042 30.8141
temp: 298.150 k
press: 1.00000 atm
elementType: 6 6 6 6 6 6 6 6 6 6 6 6 6 6 6 6 6 6 6 1 1 1 1 1 1 1 1 1 1 1 1 1 1 1 1 1 1 1 1 1 1
symmnumber: 1
zpe: 933903.6 jmol-1
zpe.correction: 0.355705 hartree
zpe.thermalcorrener: 0.371073 hartree
zpe.thermalcorrenthalpy: 0.372017 hartree
zpe.thermalcorrgfe: 0.312354 hartree
zpe.sumelectzpe: -735.864354 hartree
zpe.sumelectthermal: -735.848986 hartree
zpe.sumelectthermalent: -735.848042 hartree
zpe.sumelectthermalfe: -735.907706 hartree
dipole: 0.0785 -0.7778 0.0344
dipole: 0.7825
quadrupole: -103.4215 -106.1208 -118.4656
quadrupole: -1.2148 0.1410 0.2570
quadrupole: 5.9144 3.2152 -9.1296 -1.2148 0.1410 0.2570
hfenergy: -736.2200594 hartree
pointgroup: C01 [X(C19H22)]
dipole: 0.040983 -0.3027252 0.0381527 debye
polarizability: 247.6615808|1.3468682|246.457044|1.3558208|-8.4418567|123.1917715 unknown
InChI: InChI=1S/C19H22/c1-2-8-14(7-1)19-13-15-9-3-4-10-16(15)17-11-5-6-12-18(17)19/h5-6,11-14H,1-4,7-10H2
charge 0 multiplicity 1
41 atoms
C  -2.483003 -0.186764 -0.05898
C  -3.095216 -1.11761 -1.14816
C  -3.116336 -0.761762 1.244919
C  -4.572665 -1.314562 -0.702221
C  -4.58498 -1.090759 0.852349
C  -0.958913 -0.10142 -0.046289
C  1.216997 -1.310609 0.093998
C  1.942841 -0.111224 -0.000134
C  -0.237181 1.153633 -0.117305
C  -0.212269 -1.277942 0.066504
C  1.218514 1.138418 -0.089042
C  1.901429 -2.669065 0.226397
C  3.47151 -0.109294 0.012717
C  3.369961 -2.559884 0.684156
C  4.098476 -1.509083 -0.177944
C  -0.901319 2.424774 -0.205223
C  1.915746 2.39414 -0.14168
C  -0.190768 3.625843 -0.258968
C  1.235565 3.610608 -0.22417
H  -2.919336 0.816877 -0.216261
H  -2.560237 -2.086204 -1.14991
H  -3.00372 -0.691739 -2.163413
H  -3.04247 -0.058545 2.093781
H  -2.574799 -1.682557 1.534327
H  -4.950313 -2.314824 -0.980569
H  -5.2268 -0.57511 -1.200052
H  -5.252167 -0.248319 1.112441
H  -4.960511 -1.976174 1.396047
H  -0.740639 -2.237863 0.141509
H  1.322777 -3.302301 0.92693
H  1.867175 -3.18976 -0.754388
H  3.853052 0.564831 -0.778847
H  3.824545 0.321154 0.974122
H  3.411055 -2.254883 1.749153
H  3.867336 -3.545171 0.606019
H  4.026842 -1.807734 -1.243345
H  5.175166 -1.468392 0.073953
H  -1.994336 2.461145 -0.227708
H  3.009268 2.40016 -0.109109
H  -0.726501 4.5794 -0.32531
H  1.793619 4.552976 -0.260996
