program: Gaussian 09
title: 000270551
version: EM64L-G09RevD.01
frameworkgroup: C1[X(C19H20O3)]
method: RPBEPBE
basis: SDD
operation: Freq
keyword: #pfreq=noraman
keyword: PBEPBE/SDD
title: #p freq=noraman PBEPBE/SDD
converged: YES YES NO NO
title: Mulliken charges:
elementType: O O O C C C C C C C C C C C C C C C C C C C H H H H H H H H H H H H H H H H H H H H
charge: -0.214197 -0.416129 -0.237622 -0.217166 -0.491981 -0.468872 -0.431563 -0.423443 0.374578 0.151880 -0.443178 0.241429 0.211962 -0.433897 -0.400414 -0.389141 0.057385 -0.268652 -0.270898 -0.540229 -0.480233 0.184937 0.220289 0.233178 0.224163 0.230593 0.225851 0.207983 0.220524 0.205253 0.224396 0.242644 0.266545 0.227774 0.243790 0.230571 0.232212 0.277160 0.269690 0.250032 0.295471 0.377324
chargesum: 0.00000
title: Mulliken charges with hydrogens summed into heavy atoms:
elementType: O O O C C C C C C C C C C C C C C C C C C C
charge: -0.214197 -0.038804 -0.237622 0.003122 -0.034640 -0.012427 -0.003055 0.006206 0.374578 0.151880 -0.200534 0.241429 0.211962 -0.167352 -0.172639 -0.145351 0.057385 -0.038082 -0.038685 0.006622 0.065270 0.184937
polarizability: 3.02189079e+02 -7.51161919e+00 2.28153106e+02 1.43684645e+01 5.67396801e+00 1.38145708e+02
1716.lowfreq: -37.7307 -8.6702 -2.3589 -0.0010 -0.0009 -0.0007 5.0380 13.7753 25.1046
frequency: -37.2023 13.7462 25.0491 30.6703 33.5766 66.8519 79.0161 90.7659 136.3361 156.3438 180.3480 187.4360 204.9840 218.0628 253.7383 274.8316 299.1107 337.8860 383.1951 429.3662 431.6245 463.3912 471.3572 501.6659 523.8522 533.6380 538.4487 576.2585 585.6626 604.1230 639.1818 644.8045 651.6734 667.8979 707.1785 743.4572 773.4719 781.2717 789.1332 801.5541 812.1258 849.1834 853.1143 862.2436 875.8087 897.4073 902.5712 922.1641 943.6288 946.1878 961.4877 974.7000 990.6445 1001.0016 1010.2336 1028.5005 1036.2238 1042.2075 1052.2093 1068.9551 1075.8040 1089.0085 1128.1816 1152.1762 1157.8499 1167.0596 1180.7186 1190.1976 1214.6223 1222.0705 1231.8197 1242.3870 1251.5412 1254.0430 1268.4133 1276.7671 1290.3425 1300.3304 1304.0717 1311.2000 1322.0280 1328.6050 1362.9891 1369.2098 1389.5982 1402.1180 1438.8593 1440.8539 1454.2057 1460.6855 1464.8277 1465.9219 1475.7257 1488.6903 1522.5770 1557.8928 1581.9575 1592.6416 1622.4360 1664.2055 2981.5248 2987.1339 2988.1332 2988.5284 2993.9607 3004.3666 3027.5719 3054.4017 3058.0583 3058.9297 3065.1628 3078.8291 3087.0332 3128.5707 3130.0016 3142.6843 3155.6759 3157.1799 3169.0607 3512.5553
redmass: 2.5844 6.2239 3.4409 7.1116 6.7654 4.6620 2.8698 4.3241 5.3242 3.8301 4.3284 3.8312 4.2533 3.0980 1.9762 5.1144 4.3523 5.4796 4.2539 3.9664 3.1873 4.1075 3.3453 2.7233 2.4931 2.7059 3.3618 3.6037 3.7505 2.8835 2.3689 2.6764 2.0612 3.7917 2.9282 4.0494 1.5614 2.2876 2.6813 2.7488 1.7726 1.8693 2.0889 2.0104 1.7353 4.2702 2.3737 1.6809 1.9681 2.6351 1.3987 1.5284 1.3706 2.2301 2.0563 2.0069 2.9096 2.3574 2.1571 2.8411 2.5756 2.3075 1.3863 1.5422 1.3621 1.5242 1.1521 1.4197 1.4382 1.2751 1.4129 1.5302 2.0026 1.5105 1.6440 1.4907 1.1880 1.2298 1.4338 1.4283 1.7751 1.7698 2.5801 2.1378 2.2392 4.2258 2.3055 1.1526 2.5167 1.1214 1.0919 1.0881 1.0882 1.0998 3.7656 7.2755 5.9859 8.0195 6.1761 8.2117 1.0672 1.0658 1.0601 1.0648 1.0622 1.0666 1.0827 1.0961 1.1005 1.0936 1.1038 1.1037 1.0931 1.0879 1.0850 1.0884 1.0951 1.0942 1.0998 1.0639
irintensity: 0.0481 0.2989 0.1403 0.9355 0.4036 2.0210 1.5865 2.0008 3.9478 0.7130 2.6973 1.3239 2.6542 1.6527 1.9291 0.0497 5.8444 7.2308 0.3007 23.8940 5.6451 3.9697 1.3581 26.6796 41.3278 25.2534 12.0582 10.0465 9.8961 0.6779 23.2797 45.4630 50.2056 12.3924 1.4401 5.4084 73.9065 4.6033 2.5569 3.0629 14.1008 13.6388 17.9799 8.9272 0.5923 1.3167 6.0728 0.5335 9.9398 0.1673 1.1394 3.8100 0.2412 20.7731 28.3224 21.3384 76.8681 49.4085 10.7254 0.8144 200.6839 9.3069 38.8497 0.3638 2.9997 0.9218 2.8530 7.3081 3.1475 6.7747 2.2379 140.4041 4.1397 2.0209 23.2789 4.2479 0.1662 1.0001 1.7508 1.0135 47.1677 120.1432 37.6514 10.4439 2.9430 0.8865 6.5832 23.5149 5.4312 40.8056 6.8404 9.5189 10.1208 5.4934 37.4611 171.8307 79.0359 24.9487 0.7387 202.2081 1.8604 48.7114 37.2517 39.9550 26.9911 17.2960 18.7412 30.8251 29.3020 7.5986 17.7034 92.7558 11.8646 16.4225 0.1410 6.5354 8.2983 36.6181 23.8937 24.2386
temp: 298.150 k
press: 1.00000 atm
elementType: 8 8 8 6 6 6 6 6 6 6 6 6 6 6 6 6 6 6 6 6 6 6 1 1 1 1 1 1 1 1 1 1 1 1 1 1 1 1 1 1 1 1
symmnumber: 1
zpe: 899266.1 jmol-1
zpe.correction: 0.342512 hartree
zpe.thermalcorrener: 0.361664 hartree
zpe.thermalcorrenthalpy: 0.362608 hartree
zpe.thermalcorrgfe: 0.291745 hartree
zpe.sumelectzpe: -960.119065 hartree
zpe.sumelectthermal: -960.099913 hartree
zpe.sumelectthermalent: -960.098969 hartree
zpe.sumelectthermalfe: -960.169833 hartree
dipole: 2.8761 2.6114 0.8518
dipole: 3.9770
quadrupole: -111.4002 -123.9289 -141.4816
quadrupole: -8.6761 2.0664 -1.0263
quadrupole: 14.2034 1.6747 -15.8780 -8.6761 2.0664 -1.0263
hfenergy: -960.4615776 hartree
pointgroup: C01 [X(C19H20O3)]
dipole: 1.2133285 0.9109148 0.3825178 debye
polarizability: 299.8800682|-14.5314621|229.6522385|16.4239572|7.3408975|138.9555859 unknown
InChI: InChI=1S/C19H20O3/c20-18(11-12-19(21)22)17-10-9-14(13-5-1-2-6-13)15-7-3-4-8-16(15)17/h3-4,7-10,13,21H,1-2,5-6,11-12H2
charge 0 multiplicity 1
42 atoms
O  -2.543741 -1.742323 -1.574663
O  -6.822253 0.627894 0.053543
O  -5.7500 -0.553078 1.739284
C  3.5732 -0.386467 0.563663
C  4.091081 -1.542736 1.505305
C  4.488809 -0.472929 -0.709406
C  5.31254 -2.18689 0.782689
C  5.808172 -1.085749 -0.187763
C  2.087679 -0.434015 0.215271
C  1.257957 0.755015 0.174781
C  1.50832 -1.661582 -0.144708
C  -0.1550 0.644335 -0.163991
C  -0.717021 -0.659049 -0.438929
C  0.134219 -1.775359 -0.475003
C  1.7933 2.066659 0.419819
C  -0.926329 1.849264 -0.296954
C  -2.176045 -0.931342 -0.672105
C  1.004828 3.21375 0.319573
C  -0.367606 3.104827 -0.057138
C  -3.217341 -0.368516 0.307123
C  -4.563062 -0.077227 -0.381989
C  -5.716883 -0.044935 0.596297
H  3.799917 0.567152 1.070337
H  3.304322 -2.283681 1.727667
H  4.401161 -1.111655 2.474665
H  4.615921 0.509723 -1.198129
H  4.027053 -1.154222 -1.449655
H  4.989886 -3.070422 0.197872
H  6.092039 -2.524441 1.488571
H  6.392878 -0.323815 0.36466
H  6.448661 -1.477674 -0.99814
H  2.128242 -2.565209 -0.157493
H  -0.291844 -2.749921 -0.735099
H  2.851396 2.177077 0.673363
H  -1.964437 1.78657 -0.63773
H  1.442457 4.199901 0.508488
H  -0.975864 4.008388 -0.172704
H  -3.379928 -1.162587 1.066295
H  -2.837006 0.501245 0.864827
H  -4.548239 0.867521 -0.953713
H  -4.759794 -0.88195 -1.119693
H  -7.576042 0.593247 0.703614
