program: Gaussian 09
title: 000270549
version: EM64L-G09RevD.01
frameworkgroup: C1[X(C20H28N2O2)]
method: RPBEPBE
basis: SDD
operation: Freq
keyword: #p
keyword: freq=noraman
keyword: PBEPBE/SDD
title: #p freq=noraman PBEPBE/SDD
converged: YES YES NO NO
title: Mulliken charges:
elementType: O O N N C C C C C C C C C C C C C C C C C C C C H H H H H H H H H H H H H H H H H H H H H H H H H H H H
charge: -0.300186 -0.300190 -0.333124 -0.333090 -0.256511 -0.256479 -0.087679 -0.087707 -0.450484 -0.450471 -0.423413 -0.423421 -0.401752 -0.401749 -0.385556 -0.385544 0.564405 0.564399 -0.509291 -0.375780 -0.375883 -0.509362 -0.046073 -0.046057 0.196844 0.196835 0.256639 0.256637 0.218484 0.198006 0.218496 0.198010 0.222935 0.181626 0.222907 0.181629 0.204257 0.191006 0.204262 0.191007 0.203060 0.198081 0.198074 0.203062 0.224270 0.221303 0.221331 0.224278 0.289256 0.289255 0.199682 0.199763
chargesum: 0.00000
title: Mulliken charges with hydrogens summed into heavy atoms:
elementType: O O N N C C C C C C C C C C C C C C C C C C C C
charge: -0.300186 -0.300190 -0.043868 -0.043835 -0.059667 -0.059645 0.168961 0.168930 -0.033993 -0.033964 -0.018852 -0.018886 -0.006489 -0.006480 0.015585 0.015592 0.564405 0.564399 -0.285021 -0.154477 -0.154553 -0.285083 0.153609 0.153706
polarizability: 3.00683724e+02 -8.79897137e-03 1.89042902e+02 -4.34651532e+00 1.66027536e-02 1.91772341e+02
1716.lowfreq: -17.8262 -11.4951 -10.0230 -0.0002 0.0004 0.0005 29.9589 30.9513 39.8219
frequency: 29.9227 30.8833 39.7139 43.3278 55.9214 66.7629 68.4912 80.8520 101.2344 121.5695 156.7318 175.1708 176.6574 201.7687 206.4063 215.6551 255.8622 261.4971 302.0999 323.4795 323.5211 360.8155 385.6143 402.4307 404.1079 419.0926 421.7231 448.9119 455.9115 463.3628 479.4439 505.6934 515.3904 570.0182 582.4146 585.0054 627.0690 637.5090 716.4578 723.0636 748.1904 767.5414 786.4448 802.9540 817.4315 832.4820 843.0403 844.7289 849.3153 867.0447 874.0514 906.4788 906.7910 940.8041 941.3675 945.3305 951.8485 957.8781 959.1067 963.4420 968.7704 1011.5705 1033.2718 1034.6559 1044.9345 1045.0713 1053.5256 1053.5910 1095.4478 1105.8024 1106.2464 1119.8758 1126.4777 1129.1437 1140.0630 1181.7581 1186.1710 1191.8640 1198.7680 1199.4003 1209.3716 1212.9167 1231.5499 1233.0708 1247.7529 1247.7774 1279.9541 1284.1786 1287.3668 1287.3983 1299.2510 1299.7464 1319.1711 1323.0424 1323.2904 1333.7319 1335.2002 1337.1709 1337.9267 1341.5325 1344.8673 1345.0461 1356.0060 1378.6176 1385.0316 1388.8704 1414.3886 1460.7392 1460.7535 1461.4908 1461.5985 1465.8176 1466.3944 1471.4854 1472.7013 1474.8215 1477.8497 1504.7735 1582.1974 1614.4778 1624.0955 1628.8875 2937.4696 2937.6151 2959.3338 2959.3728 2966.9289 2967.0069 2972.1134 2972.1268 2974.2457 2975.5878 2975.6033 2976.9336 3018.8407 3018.9589 3031.4782 3031.6292 3034.8168 3034.8724 3041.8768 3041.9212 3048.1800 3048.2552 3108.0495 3108.2159 3135.9202 3141.5246 3526.6878 3526.8071
redmass: 6.7204 4.8439 4.2329 4.5154 3.8789 7.7064 4.0069 4.3457 3.5168 3.6380 4.9502 4.2467 3.3277 2.3790 2.6618 2.8187 2.9706 2.7266 2.6364 2.3995 2.0500 3.7721 3.3512 3.5634 2.8822 3.7754 3.0430 3.5447 3.4110 3.1724 3.1576 1.9409 1.9082 2.5240 1.2411 1.2265 3.7811 6.4023 4.1455 4.1099 3.3300 2.6422 1.8669 1.8877 2.0393 2.3048 1.2721 2.2670 1.9941 1.5854 1.7100 1.9654 1.8994 1.7953 2.3019 2.5076 2.1755 1.7240 1.5911 1.7035 1.3911 2.8483 3.3796 3.8095 1.9000 1.8841 1.3328 1.3517 1.8821 2.4293 2.3224 2.2556 1.9149 1.8963 1.6466 1.9709 1.8464 1.2059 1.5178 1.5050 1.5168 2.1111 1.5783 1.5424 1.4462 1.4539 1.4498 1.5557 1.3001 1.3010 1.2270 1.2122 1.2772 1.2748 1.2756 1.3810 1.3781 1.3963 1.4238 1.5439 1.4899 1.4925 1.4401 1.2449 5.0539 1.2145 2.4342 1.0904 1.0889 1.0962 1.0922 1.1874 1.1198 1.2846 1.1431 1.2593 1.5767 2.6505 6.4413 5.3155 6.4799 5.0248 1.0817 1.0819 1.0656 1.0656 1.0639 1.0639 1.0618 1.0619 1.0891 1.0617 1.0617 1.0885 1.0843 1.0843 1.0955 1.0955 1.0992 1.0992 1.0996 1.0995 1.1014 1.1014 1.0870 1.0875 1.0943 1.0956 1.0773 1.0774
irintensity: 7.8779 1.1298 0.1736 0.0481 2.2622 8.7264 0.8236 15.1932 0.1988 3.1673 3.4658 1.5824 14.2483 29.4379 34.7741 12.5124 17.8499 0.1622 0.2627 1.0209 0.9158 22.6414 3.7515 14.5518 0.6133 0.1679 0.7603 5.9315 0.2010 0.1919 3.2006 1.1629 2.4949 35.3366 161.7987 81.3850 0.6070 1.1329 11.2665 0.4221 4.2155 9.2909 0.0032 0.9715 21.8112 13.5180 2.1497 16.2525 6.7438 2.0175 1.9896 6.9212 1.8977 0.0347 6.0679 6.0399 1.0698 3.6528 1.5029 6.6837 0.1012 3.8631 3.2806 2.8845 2.2965 6.0307 4.5949 0.1902 18.9762 0.0645 1.5472 1.7338 0.2346 0.3748 15.5362 43.3314 35.4924 0.1630 5.1829 0.0141 5.9705 0.4762 1.9317 2.1243 11.7965 15.7784 3.3704 8.1409 1.6959 3.5279 22.5911 15.1189 0.0176 0.1705 0.0123 0.1029 0.1828 0.1653 0.1960 4.5420 0.0310 2.1489 0.3957 41.2665 0.4338 12.2959 9.1876 3.5513 1.1817 11.0237 8.0688 62.5417 10.7714 15.3807 12.9573 57.1439 118.6804 29.4248 0.1949 99.9562 0.5534 294.1495 40.2347 1.1868 43.5761 18.6115 54.3375 27.5652 67.5653 4.0441 50.4770 33.9664 15.1834 40.7855 2.1808 33.8186 87.0182 44.4197 65.6911 38.7774 23.8419 0.0345 19.1908 140.2094 0.1453 37.6539 38.0515 0.0502 20.9906 1.8831
temp: 298.150 k
press: 1.00000 atm
elementType: 8 8 7 7 6 6 6 6 6 6 6 6 6 6 6 6 6 6 6 6 6 6 6 6 1 1 1 1 1 1 1 1 1 1 1 1 1 1 1 1 1 1 1 1 1 1 1 1 1 1 1 1
symmnumber: 1
zpe: 1172094.7 jmol-1
zpe.correction: 0.446427 hartree
zpe.thermalcorrener: 0.469392 hartree
zpe.thermalcorrenthalpy: 0.470337 hartree
zpe.thermalcorrgfe: 0.392950 hartree
zpe.sumelectzpe: -1037.096475 hartree
zpe.sumelectthermal: -1037.073510 hartree
zpe.sumelectthermalent: -1037.072566 hartree
zpe.sumelectthermalfe: -1037.149952 hartree
dipole: -0.0059 -3.1358 -0.0011
dipole: 3.1359
quadrupole: -120.9159 -157.4654 -137.8786
quadrupole: -0.0230 -11.5331 -0.0088
quadrupole: 17.8374 -18.7121 0.8747 -0.0230 -11.5331 -0.0088
hfenergy: -1037.5429022 hartree
pointgroup: C01 [X(C20H28N2O2)]
dipole: 0.0019832 -1.2337379 -0.0002003 debye
polarizability: 300.3426802|-0.0201293|189.0429198|-7.4779119|-0.0160833|192.1133667 unknown
InChI: InChI=1S/C20H28N2O2/c23-13-21-19-7-3-1-5-17(19)15-9-11-16(12-10-15)18-6-2-4-8-20(18)22-14-24/h9-14,17-22H,1-8H2
charge 0 multiplicity 1
52 atoms
O  -1.569721 2.453937 -1.053447
O  1.56763 2.449028 1.05616
N  -2.527454 1.476664 0.854389
N  2.528477 1.476638 -0.85261
C  -2.905533 -0.986028 0.527046
C  2.905252 -0.986627 -0.527942
C  -3.361451 0.472132 0.166586
C  3.3619 0.470909 -0.165858
C  -3.810356 -2.014341 -0.20789
C  3.809529 -2.016218 0.205881
C  -4.862143 0.685134 0.484966
C  4.862716 0.683488 -0.483939
C  -5.307755 -1.797009 0.111567
C  5.307033 -1.799312 -0.113324
C  -5.748077 -0.356503 -0.236458
C  5.74809 -0.359425 0.236334
C  -1.415296 -1.16485 0.24945
C  1.414942 -1.165083 -0.250539
C  -0.481391 -1.198762 1.314755
C  0.908084 -1.191686 1.072856
C  -0.908445 -1.190348 -1.07397
C  0.481027 -1.197658 -1.315877
C  -1.675021 2.347104 0.205385
C  1.675846 2.346254 -0.202763
H  -3.073855 -1.118409 1.619403
H  3.073524 -1.117888 -1.620441
H  -3.190782 0.638416 -0.914097
H  3.191269 0.636096 0.914999
H  -3.496169 -3.03786 0.072131
H  -3.657738 -1.924796 -1.302524
H  3.494812 -3.039268 -0.075258
H  3.656949 -1.927789 1.300613
H  -5.148196 1.713319 0.194469
H  -5.017486 0.601989 1.582025
H  5.149302 1.711193 -0.192276
H  5.018041 0.601495 -1.58109
H  -5.922691 -2.53126 -0.443616
H  -5.483805 -1.982767 1.191577
H  5.921595 -2.534499 0.441033
H  5.482993 -1.983934 -1.193543
H  -6.809935 -0.200534 0.034001
H  -5.671367 -0.204948 -1.332832
H  5.671435 -0.209062 1.332876
H  6.810034 -0.203696 -0.033929
H  -0.847858 -1.194685 2.34957
H  1.596954 -1.16624 1.92524
H  -1.597304 -1.163842 -1.92633
H  0.847495 -1.1927 -2.350687
H  -2.489743 1.450669 1.876514
H  2.491078 1.451981 -1.87478
H  -1.069262 2.955121 0.911056
H  1.06873 2.953566 -0.907863
