program: Gaussian 09
title: 000276115
version: EM64L-G09RevD.01
frameworkgroup: C1[X(C14H22)]
method: RPBEPBE
basis: SDD
operation: Freq
keyword: #p
keyword: freq=noraman
keyword: PBEPBE/SDD
title: #p freq=noraman PBEPBE/SDD
converged: YES YES NO NO
title: Mulliken charges:
elementType: C C C C C C C C C C C C C C H H H H H H H H H H H H H H H H H H H H H H
charge: -0.410064 -0.214235 -0.371728 -0.363953 -0.356334 0.525543 -0.727655 -0.356414 -0.403111 -0.452618 -0.696744 -0.244477 -0.223660 -0.247863 0.195785 0.193886 0.201426 0.182647 0.215570 0.188577 0.184793 0.186718 0.190846 0.212408 0.211267 0.227569 0.193904 0.195001 0.227593 0.230675 0.210374 0.209388 0.214469 0.221476 0.222823 0.226118
chargesum: 0.00000
title: Mulliken charges with hydrogens summed into heavy atoms:
elementType: C C C C C C C C C C C C C C
charge: -0.020393 -0.012808 0.026489 0.009416 0.021231 0.525543 -0.076411 0.032490 -0.175518 -0.221944 -0.062513 -0.023002 -0.000837 -0.021745
polarizability: 1.49747178e+02 1.74784055e+01 1.52332318e+02 -1.58261273e+00 1.26815666e+00 1.36725536e+02
1716.lowfreq: -10.9122 -0.0006 0.0004 0.0006 7.8886 13.4493 26.7486 32.8927 47.4838
frequency: 26.6947 32.6727 47.3187 67.7215 79.2198 113.7590 127.4388 158.0258 177.6352 213.2133 225.2497 233.8258 243.9880 287.4444 332.4129 401.0228 404.4491 457.6521 490.8757 548.7317 557.8584 616.9348 705.4724 721.2786 727.9261 745.2842 771.2398 794.1458 850.5110 874.8561 883.8526 905.6446 915.7528 964.8116 972.8433 988.2695 991.2253 994.3070 1003.0627 1025.9681 1028.8037 1065.0863 1066.8855 1071.5523 1083.9787 1094.7886 1119.4585 1143.9616 1170.7447 1188.4631 1193.8408 1205.3200 1232.5256 1241.2622 1272.1889 1277.2356 1285.4296 1292.5950 1303.3287 1309.1039 1330.8932 1348.2868 1350.8462 1352.7740 1383.2157 1388.0660 1388.5068 1440.8398 1459.4630 1461.8746 1465.3120 1472.9190 1473.7805 1476.2833 1476.8625 1481.8428 1485.0994 1488.1466 1591.6280 1612.2899 2948.5566 2952.8595 2956.2259 2961.2471 2966.6239 2968.7226 2971.0287 2974.2120 2985.6209 2998.4067 3007.8540 3025.8830 3040.9574 3067.7672 3068.7673 3069.9038 3077.7187 3112.9966 3115.4283 3130.6395 3140.8942 3160.1335
redmass: 4.0973 3.3811 1.5922 3.1873 3.3241 1.6340 2.5246 2.3878 3.0800 2.1163 3.2606 1.1145 1.2245 2.9809 3.5026 3.0953 2.8053 3.3283 2.9994 2.7048 2.9465 6.3894 1.6515 1.1234 1.5495 1.5908 1.8524 1.2993 1.2498 1.2599 1.8961 1.8703 1.4565 1.3230 1.3871 3.7650 1.4443 3.0926 1.7998 2.0834 2.8363 1.7975 1.9251 2.1241 2.0820 1.8851 2.3256 2.1348 1.0575 1.1151 1.6507 1.8754 1.3929 1.3598 1.2796 1.2198 1.0662 1.1286 1.3481 1.3402 1.4147 1.4327 1.5448 1.6682 3.2377 1.2183 1.4011 2.1266 1.0763 1.0705 1.0756 1.0832 1.1605 1.1097 1.0452 1.1124 1.6472 1.0899 5.9509 6.1401 1.0589 1.0593 1.0600 1.0645 1.0658 1.0726 1.0365 1.0354 1.0961 1.0978 1.1018 1.1042 1.1042 1.1007 1.0994 1.0993 1.0999 1.0859 1.0864 1.0909 1.0959 1.1014
irintensity: 0.0031 0.0279 0.0059 0.0283 0.0677 0.0012 0.1920 0.4878 0.3141 0.0810 0.0841 0.0009 0.0533 0.1090 0.0788 0.0160 0.0288 2.4027 0.5732 13.6476 3.1433 0.0757 57.0946 15.2212 1.4729 1.3339 38.6347 4.1557 0.0245 1.4877 5.9748 0.0596 3.2808 0.0882 0.0748 0.9975 0.1926 1.7653 6.8255 4.1984 4.8887 7.0765 9.9387 1.6930 2.5567 6.5733 6.6945 1.4328 0.0998 0.1305 0.4328 1.3533 3.3404 0.3749 0.1305 0.5020 0.3179 0.6553 0.8826 4.9923 0.8096 0.6484 3.3289 1.2873 3.5741 9.4625 10.2604 8.5650 0.9711 0.1795 0.6666 0.2900 8.0626 5.3047 13.5161 2.8183 19.6668 23.3326 1.4068 8.2646 1.7755 3.8800 3.1468 13.9373 42.5832 118.9443 39.2034 45.3307 3.7700 5.0362 6.7804 1.0560 132.3178 76.4356 77.7309 56.0665 35.6893 10.7056 3.9559 12.8804 49.2162 24.1679
temp: 298.150 k
press: 1.00000 atm
elementType: 6 6 6 6 6 6 6 6 6 6 6 6 6 6 1 1 1 1 1 1 1 1 1 1 1 1 1 1 1 1 1 1 1 1 1 1
symmnumber: 1
zpe: 843119.2 jmol-1
zpe.correction: 0.321127 hartree
zpe.thermalcorrener: 0.336904 hartree
zpe.thermalcorrenthalpy: 0.337848 hartree
zpe.thermalcorrgfe: 0.276140 hartree
zpe.sumelectzpe: -545.599068 hartree
zpe.sumelectthermal: -545.583291 hartree
zpe.sumelectthermalent: -545.582347 hartree
zpe.sumelectthermalfe: -545.644055 hartree
dipole: 0.2105 0.3198 -0.0383
dipole: 0.3847
quadrupole: -91.9464 -85.4992 -83.2365
quadrupole: 3.3962 -0.2329 -0.6470
quadrupole: -5.0524 1.3948 3.6576 3.3962 -0.2329 -0.6470
hfenergy: -545.920195 hartree
pointgroup: C01 [X(C14H22)]
dipole: -0.0861465 -0.1242709 -0.0069641 debye
polarizability: 150.7300834|17.683091|150.9646847|0.4514151|-1.9403885|137.110264 unknown
InChI: InChI=1S/C14H22/c1-3-4-5-7-10-13(2)14-11-8-6-9-12-14/h6,8-9,11-13H,3-5,7,10H2,1-2H3
charge 0 multiplicity 1
36 atoms
C  -0.271112 -1.64154 0.361875
C  1.164278 -1.682775 -0.239092
C  -1.217308 -0.639441 -0.334931
C  -2.634129 -0.61827 0.281886
C  -3.59487 0.363151 -0.426439
C  1.904705 -0.351844 -0.07315
C  1.980816 -2.854945 0.368527
C  -5.009953 0.390339 0.195247
C  2.161513 0.18777 1.215815
C  2.366304 0.370117 -1.20289
C  -5.964292 1.37209 -0.518776
C  2.855828 1.407631 1.369115
C  3.06328 1.592261 -1.056348
C  3.311148 2.116744 0.232253
H  -0.208069 -1.398319 1.442864
H  -0.706784 -2.660427 0.298158
H  1.060388 -1.874184 -1.327733
H  -1.291229 -0.895827 -1.413062
H  -0.779239 0.377503 -0.285895
H  -2.560541 -0.346744 1.356087
H  -3.06613 -1.640999 0.2495
H  -3.672877 0.090762 -1.500049
H  -3.162786 1.385367 -0.39697
H  1.476729 -3.821142 0.179216
H  2.08797 -2.739152 1.463337
H  2.996007 -2.901575 -0.064959
H  -5.439661 -0.632096 0.166674
H  -4.930636 0.663495 1.267485
H  1.816169 -0.348565 2.108395
H  2.176876 -0.029473 -2.207296
H  -5.572904 2.406163 -0.475733
H  -6.082459 1.103771 -1.585794
H  -6.968851 1.371243 -0.056766
H  3.043163 1.80615 2.37313
H  3.410037 2.132664 -1.944843
H  3.850617 3.063293 0.350463
