program: Gaussian 09
title: 000276200
version: EM64L-G09RevD.01
frameworkgroup: C1[X(C26H23NO2S)]
method: RPBEPBE
basis: SDD
operation: Freq
keyword: #p
keyword: freq=noraman
keyword: PBEPBE/SDD
title: #p freq=noraman PBEPBE/SDD
converged: YES YES NO NO
title: Mulliken charges:
elementType: S O O N C C C C C C C C C C C C C C C C C C C C C C C C C C H H H H H H H H H H H H H H H H H H H H H H H
charge: 0.162928 -0.399444 -0.254511 -0.583920 -0.624607 0.386004 0.472334 0.472288 0.133681 -0.378194 0.381590 -0.663200 -0.352148 -0.354918 -0.399787 -0.401931 -0.331014 -0.187518 -0.283201 -0.482924 -0.448642 -0.256207 -0.242016 -0.261781 -0.249049 -0.285472 -0.250316 -0.248062 -0.245580 0.231431 0.267348 0.290174 0.279373 0.257268 0.251201 0.280792 0.270539 0.292896 0.260099 0.230046 0.240573 0.238303 0.225635 0.224660 0.235006 0.226875 0.230449 0.229174 0.226117 0.227619 0.292466 0.290772 0.376803
chargesum: 0.00000
title: Mulliken charges with hydrogens summed into heavy atoms:
elementType: S O O N C C C C C C C C C C C C C C C C C C C C C C C C C C
charge: 0.162928 -0.022641 -0.254511 -0.000682 -0.624607 0.386004 0.472334 0.472288 0.133681 -0.110846 0.381590 -0.093654 -0.094881 -0.103718 -0.118995 -0.131392 -0.038118 0.072582 -0.053155 -0.242351 -0.210339 -0.030572 -0.017355 -0.026775 -0.022175 -0.055023 -0.021142 -0.021945 -0.017961 0.231431
polarizability: 3.24320811e+02 2.87238043e+01 3.16675928e+02 2.25481551e+01 5.19445368e-01 2.96700798e+02
1716.lowfreq: -15.8534 -5.3866 0.0005 0.0011 0.0015 7.3348 10.9496 32.2077 33.5004
frequency: -11.1886 32.2038 33.4870 44.0906 49.1465 51.0432 55.3580 66.9845 70.1621 76.9994 95.3407 138.6735 147.2295 169.2697 184.7084 186.4932 211.8737 217.4680 239.0530 251.9185 264.5556 270.1802 273.1946 279.5829 303.0088 316.6660 375.1601 403.6174 404.8537 418.1792 429.1564 448.2169 471.3064 486.7941 497.6564 504.5702 518.1085 530.0259 556.9967 588.7715 612.4748 614.7460 620.1131 620.7266 623.3903 641.1992 664.7572 693.7655 704.1575 707.7383 725.9410 736.9155 744.2780 755.9882 760.7645 778.0073 786.7520 793.3694 804.8049 821.9876 855.4728 858.1501 875.7665 885.9920 892.8200 919.8879 930.8291 935.2753 936.9350 962.3053 980.0210 984.0689 987.3947 988.7154 990.6518 993.0735 996.2599 996.9788 1015.7238 1023.1612 1030.0083 1031.2853 1042.1230 1071.4976 1081.4430 1086.8314 1088.1909 1093.8072 1109.5063 1147.6084 1161.5924 1170.9741 1172.9768 1173.6699 1175.8494 1181.8339 1192.6817 1196.4139 1198.6332 1231.3109 1236.8319 1244.2617 1264.6443 1278.4051 1315.2095 1321.5618 1334.1294 1360.8394 1372.9939 1375.5864 1393.6466 1400.8448 1409.6016 1427.4894 1433.7600 1436.3680 1439.5135 1453.9852 1476.7431 1479.7493 1514.7148 1580.4368 1585.4546 1587.8875 1598.9542 1604.1969 1608.7207 1614.2683 1628.7575 1661.7342 3025.8705 3065.6628 3107.0093 3119.7619 3122.1181 3122.7802 3122.9506 3128.4428 3134.7511 3135.2889 3140.9393 3147.0807 3147.6502 3150.4153 3156.8001 3159.8589 3164.1721 3171.6201 3175.1604 3193.5081 3495.5587 3498.7474 3637.2459
redmass: 4.6384 6.1779 5.3902 5.2831 4.8419 6.2442 4.9889 4.5334 4.4640 4.8860 5.8562 4.9118 3.6934 5.0145 4.4498 4.9613 1.7627 3.6185 4.6301 3.9324 4.0782 4.8098 4.2279 2.4261 4.6615 5.6241 8.3405 2.8467 2.8850 4.2960 3.2455 2.2176 3.3171 4.0684 3.6824 2.1961 6.3071 4.7878 3.4815 3.1891 5.6810 6.2815 2.6200 1.8163 5.4029 4.8337 4.8089 4.6493 1.9142 1.6889 4.3253 1.6621 1.9074 2.3538 2.9865 2.9664 4.7521 2.2138 1.9574 1.9928 1.2484 1.2500 2.3151 3.7055 3.1270 1.4939 1.4263 1.5809 1.5961 1.3947 1.4143 1.4338 1.3678 5.4097 4.8742 1.3703 1.3330 1.3117 4.9533 4.7648 2.4663 2.2673 2.4034 2.0595 1.5020 1.9937 1.7279 1.7366 1.8701 1.6080 2.0322 1.1429 1.1279 1.4531 1.4071 1.3619 1.9349 1.1391 1.1213 2.2924 1.7862 1.3268 1.4984 1.7107 1.3607 1.3660 1.2836 2.4156 6.7669 6.5232 1.7292 2.8044 4.4644 2.1976 2.2771 1.1218 2.3743 2.2366 2.1295 2.1533 3.6625 6.7247 5.9180 6.1984 5.4158 5.9131 5.9097 1.3080 6.3375 3.7835 1.0562 1.0867 1.1082 1.0867 1.0847 1.0848 1.0864 1.0877 1.0885 1.0907 1.0925 1.0942 1.0940 1.0954 1.0982 1.0982 1.1014 1.0943 1.0952 1.0937 1.0444 1.0637 1.1006
irintensity: 0.2587 0.2985 1.2046 2.2942 0.8009 2.4196 0.5391 0.5176 2.4284 1.0176 1.3600 0.5068 0.9455 1.3501 1.7924 0.4463 43.2399 11.1703 0.1916 8.6310 0.4895 2.5061 5.2761 26.8533 0.3326 0.7947 5.4488 0.3276 0.3786 4.0079 6.1748 53.3025 0.2307 5.1786 46.4393 251.2207 14.2825 1.4562 20.1070 11.3685 1.9725 0.6011 67.7376 144.4879 4.0265 5.6085 3.0326 7.9087 34.7350 59.1996 60.4209 29.6656 20.4490 37.5848 3.4693 9.0611 3.3103 67.9090 70.7140 0.7408 1.0853 0.3471 0.9270 3.2394 2.4971 5.6142 3.0302 1.7128 1.2006 4.4004 1.0229 0.3778 0.7892 2.0713 0.5758 0.4744 0.3567 0.3242 8.7245 156.9414 17.4020 18.2728 4.1057 96.9503 57.4724 2.8147 3.0057 13.2963 8.7883 0.7824 5.0055 0.8754 2.0428 6.3412 0.8675 0.6802 2.0845 4.0168 3.7554 9.0482 4.1572 3.4012 5.9767 1.5355 4.9463 3.5370 4.9620 11.3327 1.6363 0.2984 16.7969 9.0006 2.6844 16.3003 13.6133 12.3590 4.5610 0.2174 21.0339 22.0027 11.8146 3.7987 0.6367 0.1887 4.7272 2.8661 9.1705 94.2046 1.6266 132.6267 10.9734 5.6227 8.4977 1.0157 2.5741 0.4499 3.4977 2.3172 10.0193 16.1738 18.5071 27.7983 27.6510 29.4586 40.8333 25.0116 26.6729 7.3254 9.4841 4.2006 13.8245 24.1539 10.3520
temp: 298.150 k
press: 1.00000 atm
elementType: 16 8 8 7 6 6 6 6 6 6 6 6 6 6 6 6 6 6 6 6 6 6 6 6 6 6 6 6 6 6 1 1 1 1 1 1 1 1 1 1 1 1 1 1 1 1 1 1 1 1 1 1 1
symmnumber: 1
zpe: 1096296.0 jmol-1
zpe.correction: 0.417557 hartree
zpe.thermalcorrener: 0.443657 hartree
zpe.thermalcorrenthalpy: 0.444601 hartree
zpe.thermalcorrgfe: 0.360882 hartree
zpe.sumelectzpe: -1605.728515 hartree
zpe.sumelectthermal: -1605.702415 hartree
zpe.sumelectthermalent: -1605.701471 hartree
zpe.sumelectthermalfe: -1605.785190 hartree
dipole: -1.3468 -1.3369 0.8363
dipole: 2.0738
quadrupole: -176.3665 -166.5194 -171.6345
quadrupole: 3.7178 -1.4145 -5.1436
quadrupole: -4.8597 4.9874 -0.1277 3.7178 -1.4145 -5.1436
hfenergy: -1606.1460722 hartree
pointgroup: C01 [X(C26H23N1O2S1)]
dipole: -0.6051205 -0.439157 0.3266278 debye
polarizability: 336.2076773|23.8774778|306.9810782|22.21432|-3.928135|294.5087809 unknown
InChI: InChI=1S/C26H23NO2S/c27-24(25(28)29)18-30-26(20-12-3-1-4-13-20,21-14-5-2-6-15-21)23-17-9-11-19-10-7-8-16-22(19)23/h1-17,24,28H,18,27H2
charge 0 multiplicity 1
53 atoms
S  0.961313 -0.41279 -1.356585
O  4.171388 -1.978223 -2.690985
O  4.419953 -1.460609 -0.441384
N  2.844857 -4.04672 -0.488875
C  0.056803 0.696669 0.008085
C  -0.774763 -0.255742 0.896259
C  1.106314 1.507874 0.820473
C  -0.780099 1.716984 -0.800231
C  -1.869781 -1.065778 0.373551
C  -0.436689 -0.393034 2.252351
C  -2.589433 -1.945666 1.280971
C  1.431851 -1.962749 -0.364812
C  0.651169 2.60885 1.599135
C  -0.197132 2.386382 -1.908226
C  2.487683 1.199553 0.845576
C  -2.082399 2.098569 -0.390387
C  -2.282779 -1.060596 -1.004027
C  2.46492 -2.795929 -1.164339
C  -1.143105 -1.265152 3.134225
C  -2.208869 -2.024188 2.660877
C  -3.675986 -2.745643 0.791579
C  1.54714 3.371766 2.376413
C  -0.907117 3.38676 -2.604859
C  3.387951 1.963423 1.625675
C  -2.791571 3.106847 -1.081086
C  -3.339576 -1.856788 -1.452945
C  -4.051379 -2.705762 -0.550848
C  2.925167 3.051809 2.395963
C  -2.210305 3.753097 -2.194541
C  3.760789 -1.999479 -1.360835
H  0.389492 0.194661 2.659741
H  0.524378 -2.562113 -0.187404
H  1.866303 -1.649326 0.599507
H  -0.410487 2.876925 1.589326
H  0.821116 2.12844 -2.221488
H  2.881302 0.380157 0.238619
H  -2.548641 1.602025 0.466653
H  -1.751673 -0.431586 -1.718955
H  2.063956 -3.048099 -2.160234
H  -0.838157 -1.324711 4.184541
H  -2.765676 -2.692827 3.328316
H  -4.205512 -3.395419 1.498924
H  1.169979 4.21843 2.961417
H  -0.440774 3.885559 -3.461973
H  4.451511 1.700034 1.621493
H  -3.798783 3.382782 -0.748843
H  -3.625741 -1.827436 -2.510086
H  -4.881737 -3.320378 -0.915602
H  3.624037 3.646059 2.995454
H  -2.761644 4.532273 -2.732703
H  2.210635 -4.835772 -0.616376
H  3.210271 -3.937023 0.459919
H  5.035731 -1.487392 -2.763616
