program: Gaussian 09
title: 000270515
version: EM64L-G09RevD.01
frameworkgroup: C1[X(C6H10N2)]
method: RPBEPBE
basis: SDD
operation: Freq
keyword: #pfreq=noraman
keyword: PBEPBE/SDD
title: #p freq=noraman PBEPBE/SDD
converged: YES YES NO NO
title: Mulliken charges:
elementType: N N C C C C C C H H H H H H H H H H
charge: -0.351619 -0.538670 0.380950 -0.402442 -0.556662 -0.349149 -0.294946 -0.209937 0.207545 0.205050 0.215373 0.204508 0.241655 0.217110 0.294049 0.210266 0.261193 0.265725
chargesum: 0.00000
title: Mulliken charges with hydrogens summed into heavy atoms:
elementType: N N C C C C C C
charge: -0.057570 -0.011753 0.380950 0.010153 -0.136781 -0.107493 -0.077835 0.000330
polarizability: 1.03726641e+02 -1.91447584e+00 8.15150580e+01 -3.30306593e+00 6.51119569e-01 4.90346082e+01
1716.lowfreq: -14.1553 0.0001 0.0003 0.0008 5.5106 13.2608 67.0277 88.7175 157.5706
frequency: 67.0211 88.7073 157.5670 218.0665 303.7161 333.1734 388.4769 406.4688 507.0370 580.0368 603.8224 649.5284 708.5695 756.4191 849.2293 869.6838 891.1884 940.1624 951.2232 980.2310 1036.8224 1056.4045 1123.1476 1176.7712 1203.2542 1224.9947 1251.3906 1299.6666 1314.8032 1336.1002 1352.5297 1410.1296 1458.8338 1477.2399 1504.5051 1607.5174 1641.9468 1662.7240 2832.8154 2972.9412 2979.2084 3025.5789 3100.7534 3127.1112 3145.6096 3437.7086 3565.3679 3582.6361
redmass: 2.4147 2.2910 3.5068 1.2711 1.9841 2.1759 2.8836 1.6012 2.4583 1.7648 5.3368 2.3422 1.7161 3.0266 1.3496 1.4390 2.7013 1.4587 2.6054 2.2598 1.8973 4.2545 1.2357 1.0609 1.5974 1.5371 1.8607 1.2703 1.3871 1.2603 1.4371 2.1305 1.0889 1.4589 1.1959 5.3638 1.0966 5.6173 1.0739 1.0603 1.0858 1.1031 1.0865 1.0926 1.0968 1.0448 1.0968 1.0776
irintensity: 1.4368 1.6093 0.5051 41.7542 45.9925 69.4717 13.8623 78.4817 25.2338 92.9352 10.7784 232.1980 48.8069 61.0989 7.8328 7.2825 4.8532 2.3198 9.7593 30.1360 10.7056 12.5443 3.1613 2.6348 14.6536 3.2323 40.9006 5.0281 31.2736 8.2980 12.0892 2.2866 10.6482 46.5835 10.4395 53.1593 30.8800 56.5269 180.0298 70.6246 59.3882 31.0836 16.0949 15.6597 22.0868 1.7203 0.3987 27.8972
temp: 298.150 k
press: 1.00000 atm
elementType: 7 7 6 6 6 6 6 6 1 1 1 1 1 1 1 1 1 1
symmnumber: 1
zpe: 401699.1 jmol-1
zpe.correction: 0.152999 hartree
zpe.thermalcorrener: 0.161387 hartree
zpe.thermalcorrenthalpy: 0.162331 hartree
zpe.thermalcorrgfe: 0.119958 hartree
zpe.sumelectzpe: -343.474928 hartree
zpe.sumelectthermal: -343.466540 hartree
zpe.sumelectthermalent: -343.465596 hartree
zpe.sumelectthermalfe: -343.507969 hartree
dipole: 2.7286 -0.5584 -0.6614
dipole: 2.8626
quadrupole: -51.0220 -41.4068 -50.3288
quadrupole: -4.9242 -0.4425 0.5593
quadrupole: -3.4362 6.1791 -2.7429 -4.9242 -0.4425 0.5593
hfenergy: -343.6279268 hartree
pointgroup: C01 [X(C6H10N2)]
dipole: -1.0625622 0.2261111 -0.2970657 debye
dipolederiv: -1.042532 0.4602189 -0.0448069 -0.2631361 -0.203823 -0.0143132 -0.2547334 0.2079695 -0.5381675 -1.2412915 0.0173884 0.0461937 -0.0888971 -0.2294628 -0.0881046 0.0830701 -0.1022025 -0.352956 -0.3439261 0.1472579 0.0707731 0.055447 -0.5154126 0.0089536 -0.0733784 0.0706639 -0.2405098 0.4824211 0.0968224 -0.1318066 0.306363 0.0998424 -0.0596358 -0.1038458 -0.0315116 0.5049772 0.81587 -0.0505122 -0.0252924 -0.0814652 0.23075 0.1078143 -0.0476609 0.0625516 0.4034567 0.8382495 -0.6356969 0.2360917 -0.1566359 0.1876251 -0.0257695 0.3008737 -0.2104028 -0.0417183 0.0974932 0.1638296 0.0067262 0.1563981 0.4304665 0.0383866 0.0042462 0.1164064 -0.1441509 -0.183089 -0.195535 0.0504231 -0.0432809 -0.0383587 0.0651958 -0.0167846 -0.0431607 -0.2866504 -0.1372931 -0.0381555 -0.1152658 -0.0199048 0.0674874 0.0007446 -0.1686401 -0.0024996 -0.0580133 -0.1578215 -0.0298034 0.1129984 -0.0019332 0.0795347 -0.0127127 0.2901584 0.0114127 -0.1795601 -0.0613238 0.0384446 -0.04979 0.0923837 0.0337646 0.1361927 -0.0637302 0.0643755 -0.1106015 0.0042585 0.0099905 0.0165076 -0.0518534 -0.1772222 -0.1024956 0.0163565 -0.0335992 0.057735 0.0467784 -0.0694356 -0.0274785 -0.0639864 -0.0836121 -0.0017797 -0.0018475 -0.0421949 0.1660489 0.0009041 0.1424829 -0.007874 0.0981599 -0.0538998 -0.0147173 -0.0095769 -0.016694 0.1462691 0.1256951 0.00195 -0.0406216 -0.0144834 0.1271761 0.0265345 -0.0190279 0.0020221 0.3653043 0.0224274 -0.067889 -0.0328783 -0.0724037 -0.0994958 -0.0471829 -0.018331 -0.0611802 0.1697193 0.3354256 0.1024707 -0.1029025 0.1130106 0.168915 0.0126357 -0.0069077 0.0346466 -0.0046061 0.397754 -0.0938283 0.0390027 0.0362178 -0.0242747 -0.0297465 0.0897595 -0.0266027 0.1434235 unknown
polarizability: 103.3380355|-1.987047|81.4419485|5.7402347|1.2426873|49.4963236 unknown
InChI: InChI=1S/C6H10N2/c7-4-6-2-1-3-8-5-6/h1-2,5,8H,3-4,7H2
charge 0 multiplicity 1
18 atoms
N  -1.559218 1.152435 -0.307915
N  3.054985 -0.077985 -0.40342
C  0.610192 0.222236 0.266222
C  -2.281615 -0.127912 -0.117203
C  2.081553 0.396595 0.617791
C  -0.221866 1.30219 0.047402
C  0.037864 -1.106141 0.01956
C  -1.29828 -1.289724 -0.212296
H  -3.066194 -0.217068 -0.895624
H  -2.811716 -0.145301 0.868879
H  2.326786 -0.139498 1.556009
H  2.281399 1.468176 0.815285
H  0.147023 2.333932 0.095106
H  0.715895 -1.969911 -0.016232
H  -2.111445 1.9836 -0.511596
H  -1.710341 -2.281408 -0.431254
H  2.864386 0.299385 -1.339108
H  3.156293 -1.098303 -0.434305
